program: TURBOMOLE
programVersion: 7.3
elementType: f
basis: def2-TZVP
elementType: v
elementType: o
elementType: c
elementType: h
method: uhf
method: dft
functional: b3-lyp
elementType: f v o c h
basis: def2-TZVP def2-TZVP def2-TZVP def2-TZVP def2-TZVP
correction: disp3
energy: -6348.030375629 hartree
formula: C10H30FO15V5
InChI: InChI=1/10CH3O.F.5O.5V/c10*1-2;;;;;;;;;;;/h10*1H3;;;;;;;;;;;/rC10H30O15V5.F/c1-16-26(11)17(2)27(16,12)20(5)29(14,21(27)6)24(9)30(15,25(29)10)22(7)28(13,18(26)3,19(26)4)23(30)8;/h1-10H3;
61 atoms
F  0.0096381 -0.12172235 -0.005573
V  0.20005812 -2.50389031 -0.02995409
V  -2.32135338 -0.95455832 0.0109417
V  1.32889638 2.23591742 0.09043336
V  -1.68706303 1.98504132 -0.04962908
V  2.42850654 -0.55979848 -0.03017549
O  0.32743837 -4.0731309 -0.04662348
O  -3.78653761 -1.5290137 0.02605519
O  2.18543434 3.5535699 0.12063255
O  -2.75186642 3.14101846 -0.05280958
O  3.96802034 -0.88613555 -0.05093978
O  1.62110436 -1.87665276 1.23235781
O  -1.2699375 -2.09440738 1.23712961
O  -0.16021154 2.5281626 -1.17216734
O  -1.30869309 -2.09029588 -1.2788666
O  -2.34987077 0.61841846 1.24603101
O  2.20548843 1.0236696 -1.23256151
O  -2.38348246 0.57383337 -1.23676881
O  2.24752792 0.93319013 1.24961881
O  -0.2646027 2.49359492 1.22112122
O  1.58344998 -1.83505928 -1.28424419
C  2.42093075 -2.8022352 1.91912895
H  2.98144813 -3.44029304 1.22795422
H  3.13591216 -2.2739442 2.55982199
H  1.79200509 -3.44345094 2.54670969
C  -1.04055789 -1.75472181 2.57447428
C  0.0088929 2.58449468 -2.55598719
H  -0.46414852 -2.5453568 3.06634629
H  -0.92809373 2.87649827 -3.0393143
H  -0.48482561 -0.81644238 2.64990036
H  -1.99599561 -1.64435285 3.09918338
H  0.7659429 3.33786458 -2.8022421
C  -1.94586633 -3.11659157 -1.99217761
H  -2.39347746 -3.85563998 -1.31951458
H  -2.73806292 -2.69651483 -2.62189297
H  -1.22045382 -3.62936987 -2.63351326
C  -3.48611133 0.87136535 2.0304677
C  3.290172 1.47182692 -2.00261181
H  -4.37074637 1.04351049 1.40867254
H  3.62627797 0.67292274 -2.67255794
H  -3.68502385 0.01541149 2.68451394
H  4.13338407 1.7692763 -1.37060396
H  -3.32153359 1.75736941 2.65315365
H  2.98892072 2.33341008 -2.60831037
C  -2.45281104 0.42540353 -2.62141807
C  2.35091807 0.7686264 2.63012456
H  -3.2835526 -0.24244851 -2.87716607
H  2.38120126 1.74280561 3.12810727
H  3.28023871 0.23769131 2.86713017
H  -1.5306277 -0.0047413 -3.02501811
H  1.5132146 0.18717093 3.02855771
C  -0.43456453 2.49304842 2.60589617
C  1.30083248 -1.508942 -2.61466467
H  0.44498153 2.92263565 3.09435778
H  2.22575152 -1.23717271 -3.13541166
H  -1.30238469 3.10871577 2.86885977
H  0.60287266 -0.66946624 -2.67190685
H  -0.60037306 1.48061852 2.98730122
H  0.85678846 -2.37079097 -3.12400587
H  0.33711987 1.62067646 -2.95752563
H  -2.63717486 1.39297615 -3.09854308
nucrepener: 7630.027337520 hartree
empdispcorrection: -0.137027125 hartree
energy: -6348.0303756291751
energyOcCorr: -6348.0342205766
s2: 8.79528400
charge: -1.000000
dipole: -3.776698 3.776610 -0.000088 3.091933 -2.975562 0.116371 -1.260114 1.265595 0.005482
quadrupole: 4998.522427 -5216.190213 -217.667786 4793.547935 -5017.016071 -223.468136 2439.853035 -2596.545389 -156.692353 20.659639 -20.217243 0.442396 19.972759 -19.141920 0.830839 28.369531 -28.980952 -0.611421
