program: TURBOMOLE
programVersion: 7.3
elementType: v
basis: def2-TZVP
elementType: o
elementType: c
elementType: h
elementType: cl
method: uhf
method: dft
functional: pbe0
elementType: v o c h cl
basis: def2-TZVP def2-TZVP def2-TZVP def2-TZVP def2-TZVP
correction: disp3
energy: -8898.621616072 hartree
formula: C36H84ClO18V6
InChI: InChI=1/12C3H7O.Cl.6O.6V/c12*1-2-3-4;;;;;;;;;;;;;/h12*2-3H2,1H3;;;;;;;;;;;;;/rC36H84O18V6.Cl/c1-13-25-43-55(37)44(26-14-2)56(43,38)47(29-17-5)58(40,48(56)30-18-6)51(33-21-9)60(42,52(58)34-22-10)53(35-23-11)59(41,54(60)36-24-12)49(31-19-7)57(39,45(55)27-15-3,46(55)28-16-4)50(59)32-20-8;/h13-36H2,1-12H3;
145 atoms
V  0.97674692 2.91926735 -0.003825
V  -0.94301243 -2.95517113 -0.0098806
V  -2.0354462 2.26641341 0.0049387
V  2.08149768 -2.32138799 -0.0051654
V  -3.00374761 -0.65843864 0.0063109
V  3.03228771 0.61789006 0.0035459
O  1.46734082 4.41393906 -0.01967179
O  -3.08912088 3.43508185 0.007963
O  3.13552786 -3.48864682 -0.0076211
O  -4.54246621 -0.98475151 0.02252379
O  4.5727046 0.93683903 0.01844389
O  2.27308111 1.99893161 -1.21998912
O  -2.23068182 -2.05167499 1.21770722
O  -0.56654367 2.74079122 -1.22698701
O  0.60003286 -2.80724739 1.21468262
O  -0.60231756 2.95573114 1.21890332
O  0.64062925 -2.96410373 -1.22910211
O  -2.87269477 0.91871144 -1.21225232
O  2.87319247 -0.95957732 1.22074972
O  -2.66027275 0.85339076 1.23465011
O  2.71711613 -0.89783834 -1.22338452
O  -2.09957427 -1.90691925 -1.22667402
O  2.12026946 1.88068936 1.22471452
O  -1.42636534 -4.45230055 -0.02921379
C  2.45536263 -0.84812796 -2.60529298
C  3.57211749 -1.5316517 -3.37142727
H  2.35733277 0.19637012 -2.91346155
H  1.49046021 -1.32372308 -2.80220429
C  4.91053246 -0.83149397 -3.20490774
H  3.65198076 -2.56260839 -3.00929561
H  3.28953461 -1.58436908 -4.42963636
H  5.15638487 -0.72348992 -2.14671735
H  5.71628104 -1.38798675 -3.69003995
H  4.88839137 0.17149663 -3.64161466
C  -1.87160396 -1.73060342 -2.60501358
C  -2.62248317 -2.7854447 -3.39536446
H  -0.79622328 -1.7825344 -2.7968364
H  -2.19210444 -0.72570342 -2.89357196
C  -4.12957657 -2.67792375 -3.23362653
H  -2.33760748 -2.70022694 -4.45085145
H  -2.2882337 -3.77073082 -3.052118
H  -4.40329397 -2.69781704 -2.17690154
H  -4.50578642 -1.74009412 -3.65327936
H  -4.64576007 -3.49869362 -3.73778073
C  -0.46772442 2.43494274 -2.59919458
C  -0.43252203 3.71440183 -3.41308615
H  -1.32013018 1.81304468 -2.88687976
H  0.43057623 1.83320148 -2.76431421
C  -1.70982262 4.52750421 -3.28489361
H  0.41725964 4.3137995 -3.06847489
H  -0.23887091 3.45722874 -4.46129294
H  -2.56314319 3.99200203 -3.71162604
H  -1.93524514 4.72164184 -2.23436282
H  -1.62725366 5.48704734 -3.8014052
C  -3.83607159 1.24268931 -2.19055734
C  -5.17873196 1.67575304 -1.63574796
H  -3.98136323 0.36841856 -2.83854718
H  -3.43296005 2.04512989 -2.82190579
C  -6.14773798 1.99966941 -2.76051921
H  -5.571955 0.87330786 -1.0081822
H  -5.02656062 2.54790669 -0.99672041
H  -7.11799249 2.31299379 -2.36842127
H  -5.76974933 2.81023379 -3.39179966
H  -6.31723501 1.13042205 -3.40408506
C  0.83179827 -3.89802406 -2.2690432
C  1.13815465 -5.30266751 -1.78861199
H  1.65091765 -3.5465222 -2.90905525
H  -0.07103317 -3.91609186 -2.89244486
C  1.33326318 -6.24878484 -2.96141433
H  2.0355718 -5.26898382 -1.16672034
H  0.31470877 -5.63960108 -1.15502424
H  1.55442829 -7.26244594 -2.61945777
H  0.43600653 -6.29962552 -3.58641308
H  2.16247185 -5.92732036 -3.59962108
C  3.01807661 2.64807426 -2.22682802
C  4.0592927 3.61893647 -1.70586093
H  2.32168428 3.17717885 -2.89000286
H  3.51918951 1.88457596 -2.83579088
C  4.83505529 4.24753173 -2.85123657
H  3.5574682 4.38641777 -1.11309146
H  4.73242094 3.07701509 -1.03762629
H  4.17287855 4.79717271 -3.52789491
H  5.5853272 4.95034885 -2.48192082
H  5.35677749 3.48876272 -3.44321094
C  1.92355824 1.67025094 2.60310137
C  3.0591675 2.29473759 3.39147166
H  1.85391117 0.59531337 2.791927
H  0.96248432 2.10188687 2.89601986
C  3.12158137 3.8048395 3.23421563
H  2.94607324 2.0180309 4.44650075
H  3.99927383 1.85267057 3.0434338
H  2.23341472 4.28291281 3.65812336
H  3.99693442 4.22368713 3.73681683
H  3.16888885 4.07769379 2.17816694
C  0.57784887 -2.5431284 2.59701938
C  1.13205505 -3.72952183 3.36297967
H  -0.44968512 -2.33014948 2.90397956
H  1.15699674 -1.63708075 2.795679
C  0.28689209 -4.98132784 3.19574254
H  2.14798165 -3.92383835 3.00167431
H  1.21514302 -3.45487164 4.42132736
H  0.74985021 -5.8444563 3.68041745
H  -0.70737442 -4.84763689 3.63259677
H  0.15193074 -5.21307284 2.13745166
C  -2.36149747 0.72057002 2.60552897
C  -3.63325547 0.82853017 3.42526875
H  -1.64669085 1.49795451 2.89033336
H  -1.86365717 -0.23951461 2.76864491
C  -4.2996282 2.18848984 3.3005683
H  -4.3253107 0.05097838 3.08379719
H  -3.39438556 0.60725156 4.47236694
H  -4.47193064 2.43478324 2.25094601
H  -5.26011453 2.21302053 3.82133099
H  -3.67066315 2.97666213 3.72508793
C  -2.96033743 -2.71900203 2.22382752
C  -4.03541431 -3.65147536 1.70153263
H  -3.41470275 -1.96710023 2.88181097
H  -2.25807981 -3.2966637 2.83866628
C  -4.75532132 -4.34365239 2.84672738
H  -4.73815463 -3.07278079 1.09852157
H  -3.56571209 -4.38539277 1.04274869
H  -5.23523414 -3.61918058 3.51248591
H  -5.53260222 -5.01593402 2.47643162
H  -4.063636 -4.93986915 3.45045364
C  -0.81639748 3.94928034 2.19721573
C  -1.11170446 5.3286465 1.64175285
H  0.07369497 4.00427932 2.83763858
H  -1.65104875 3.63292727 2.83616268
C  -1.31968998 6.32976801 2.76575851
H  -0.27879339 5.63323468 1.0047022
H  -2.00163521 5.26744992 1.0120991
H  -1.53389659 7.32634111 2.37293427
H  -2.15829805 6.04090522 3.40738905
H  -0.43027713 6.40907238 3.39907496
C  3.77930821 -1.2555296 2.26075461
C  5.14712437 -1.69869323 1.7810686
H  3.34412468 -2.04145239 2.89090806
H  3.88678977 -0.36596195 2.89407666
C  6.06217471 -2.00517371 2.95472874
H  5.02386082 -2.58005709 1.14772495
H  5.5704018 -0.90681274 1.15908524
H  7.04951992 -2.32485408 2.61374627
H  6.20159315 -1.12616325 3.59206129
H  5.65396947 -2.80527539 3.58046239
Cl 0.01657789 -0.02099759 -0.0010539
empdispcorrection: -0.194366338 hartree
energy: -8898.6216160720342
energyOcCorr: -8898.6251700377
elementType: v o c
s2: 12.07339767
charge: -1.000000
dipole: -0.064728 0.102245 0.037516 -1.834909 1.799068 -0.035841 -0.629449 0.631529 0.002079
quadrupole: 17984.398276 -18376.052131 -391.653854 18002.002211 -18393.667323 -391.665112 8996.676184 -9314.222649 -317.546466 23.026466 -22.934947 0.091519 -1.718699 1.792796 0.074097 15.733465 -15.856699 -0.123233
