program: Gaussian 09
title: 000050376
version: EM64L-G09RevD.01
frameworkgroup: C1[X(C12H22Cl3O5P)]
method: RPBEPBE
basis: SDD
operation: Freq
keyword: #p
keyword: freq=noraman
keyword: PBEPBE/SDD
title: #p freq=noraman PBEPBE/SDD
converged: YES YES NO NO
title: Mulliken charges:
elementType: Cl Cl Cl P O O O O O C C C C C C C C C C C C H H H H H H H H H H H H H H H H H H H H H H
charge: 0.146403 0.107080 0.145304 1.302492 -0.238206 -0.504432 -0.520961 -0.595914 -0.207023 -0.282970 -0.382048 -0.346030 -0.513139 -0.347392 -0.621675 0.318631 -0.693099 -0.256865 -0.206351 -0.635397 -0.658191 0.377731 0.209331 0.229252 0.207652 0.189474 0.237155 0.236607 0.200885 0.190262 0.212296 0.217165 0.209872 0.225139 0.244168 0.232174 0.221464 0.239965 0.214215 0.215147 0.237058 0.233577 0.209195
chargesum: 0.00000
title: Mulliken charges with hydrogens summed into heavy atoms:
elementType: Cl Cl Cl P O O O O O C C C C C C C C C C C C
charge: 0.146403 0.107080 0.145304 1.302492 -0.238206 -0.504432 -0.520961 -0.595914 -0.207023 0.094761 0.056536 0.051095 -0.039376 0.043754 -0.621675 0.318631 -0.053767 0.212442 0.247287 0.033930 0.021639
polarizability: 2.35554303e+02 4.47393318e+00 1.91504076e+02 -1.97535446e+00 -1.06971389e+01 1.84619686e+02
1716.lowfreq: -7.1901 -0.0029 -0.0024 -0.0021 6.6013 8.9469 12.5070 13.7173 26.1036
frequency: 10.3535 12.3631 25.8886 29.4200 37.7848 43.0752 47.3063 52.7122 54.7381 65.3961 73.0671 77.4782 99.2381 115.2255 124.6678 160.2807 163.3696 177.7262 182.4178 190.0800 196.4461 202.3280 223.2842 237.0195 245.2098 254.2534 267.9761 278.2410 285.1086 309.7336 320.2830 359.2901 383.3622 388.4459 405.4436 435.5814 457.6848 483.1012 549.1253 585.8409 614.8305 662.2323 676.0507 688.7571 712.7857 730.5766 757.4302 793.9149 801.1474 810.9675 834.7127 850.2511 856.8444 886.6743 908.9476 918.8715 981.6329 991.4036 1010.0419 1017.4059 1025.7712 1035.0804 1059.2257 1081.9815 1091.7261 1095.1462 1107.8165 1108.2648 1133.8941 1144.1159 1158.8767 1210.1624 1213.9102 1240.1512 1253.5634 1272.9456 1275.1516 1280.4342 1288.4420 1296.3769 1316.3795 1340.1747 1353.8379 1356.7600 1364.2079 1390.5129 1391.1914 1395.6828 1444.5307 1458.7859 1462.0884 1464.1823 1465.7704 1467.7957 1476.8458 1477.7496 1478.1409 1478.2437 1487.3408 1487.7624 1680.0499 2961.7471 2969.8053 2973.6803 2986.8170 2989.3801 2989.9080 2996.8420 3002.2264 3009.2935 3014.4461 3022.3880 3026.7056 3054.4114 3056.6619 3070.2076 3073.2110 3076.6482 3082.5344 3090.2526 3093.3228 3106.3617 3111.6472
redmass: 4.2569 4.6049 4.4071 3.5529 4.8198 3.8159 5.0895 1.9111 1.9641 3.4997 4.3107 5.0649 7.8253 4.6026 3.5594 5.6942 3.5034 11.3503 3.3353 2.8827 5.4570 6.3946 1.2282 1.4940 3.7651 1.5411 12.5010 3.1953 7.8295 4.2995 3.9326 13.2756 2.7806 4.0917 3.8865 4.2112 4.5702 9.1455 7.6668 6.3914 5.7680 2.6738 6.7011 8.5819 7.4907 1.1538 4.8552 1.4463 1.1268 1.0885 4.1483 2.2793 3.8031 3.8322 1.8609 1.4772 8.2023 2.0447 2.7705 2.4160 2.6355 14.5171 2.8239 4.5205 2.2208 2.4050 2.2454 2.0651 1.4165 1.5566 2.2428 1.4125 1.4314 1.1844 1.1507 1.2399 1.1193 1.2314 1.2622 1.1094 1.2668 1.4111 1.2314 1.2309 1.5680 1.2352 1.2179 1.2445 1.0930 1.0396 1.0442 1.0718 1.0699 1.0746 1.0518 1.0582 1.0533 1.0580 1.0831 1.0811 11.1037 1.0588 1.0600 1.0362 1.0358 1.0626 1.0535 1.0389 1.0964 1.0601 1.0607 1.0824 1.1018 1.1084 1.1031 1.1008 1.0993 1.1040 1.0976 1.1014 1.0982 1.1042 1.1023
irintensity: 0.2622 0.2029 0.1943 0.7233 0.1996 0.2733 0.2653 1.3836 1.1477 0.1800 1.8912 1.0332 1.1383 2.4350 1.0367 0.6598 0.2191 0.4778 4.9109 4.4727 2.7127 6.7964 0.7092 2.1468 0.7640 0.2445 0.4359 11.5905 2.1540 10.9913 3.4337 1.6085 0.0522 14.2033 9.2371 7.9966 37.2260 98.8727 16.0277 47.9479 51.2542 5.7413 19.8077 52.1899 107.5320 9.1556 29.1979 6.1655 5.2159 3.2365 112.7586 14.8307 158.9001 199.8396 17.6724 25.8208 144.5664 13.0085 108.1910 201.6564 78.2127 94.7938 23.5224 36.9409 19.5974 21.2498 12.5123 4.3883 5.4796 5.4320 64.0972 59.8176 5.3850 12.4144 0.2037 3.6849 1.6505 3.1003 35.5243 3.9465 2.5889 5.0857 9.1562 7.3974 1.9377 23.0535 12.5084 27.9993 11.2477 12.8783 14.1117 4.3085 2.2372 0.3221 9.6443 8.4402 12.5469 12.4605 15.6606 8.2846 140.4962 2.1776 44.2186 36.5162 15.4488 43.1442 28.8016 25.0355 2.8334 33.2670 14.1475 28.9947 19.7627 12.4900 25.2589 95.5074 52.0801 1.9099 46.1857 22.9270 29.2487 31.3434 30.9427
temp: 298.150 k
press: 1.00000 atm
elementType: 17 17 17 15 8 8 8 8 8 6 6 6 6 6 6 6 6 6 6 6 6 1 1 1 1 1 1 1 1 1 1 1 1 1 1 1 1 1 1 1 1 1 1
symmnumber: 1
zpe: 870195.9 jmol-1
zpe.correction: 0.331440 hartree
zpe.thermalcorrener: 0.359398 hartree
zpe.thermalcorrenthalpy: 0.360342 hartree
zpe.thermalcorrgfe: 0.266711 hartree
zpe.sumelectzpe: -2566.274447 hartree
zpe.sumelectthermal: -2566.246489 hartree
zpe.sumelectthermalent: -2566.245544 hartree
zpe.sumelectthermalfe: -2566.339175 hartree
dipole: 0.3136 3.4384 0.3054
dipole: 3.4662
quadrupole: -138.9651 -146.7663 -162.6710
quadrupole: -0.5020 -9.2934 -8.0049
quadrupole: 10.5024 2.7012 -13.2035 -0.5020 -9.2934 -8.0049
hfenergy: -2566.6058867 hartree
pointgroup: C01 [X(C12H22Cl3O5P1)]
dipole: -0.1767155 -1.3318206 0.2338398 debye
polarizability: 235.8564902|2.9214154|192.9510538|1.9829455|9.8946698|182.870521 unknown
InChI: InChI=1S/C12H22Cl3O5P/c1-4-7-8-9-10(16)20-11(12(13,14)15)21(17,18-5-2)19-6-3/h11H,4-9H2,1-3H3
charge 0 multiplicity 1
43 atoms
Cl 1.476241 3.054106 -0.640448
Cl -1.464683 2.483208 -0.222659
Cl -0.025759 1.302601 -2.608449
P  2.260014 -0.208148 -0.305354
O  -0.495669 -0.473033 -0.149114
O  2.031496 -1.899724 0.038629
O  2.973526 0.376519 1.151273
O  3.036667 0.056085 -1.671589
O  -0.716295 -0.661393 2.177191
C  0.511888 0.552347 0.044773
C  -3.325384 -1.419556 -0.077999
C  -4.118692 -0.40703 0.777014
C  -2.116468 -2.052641 0.670013
C  -5.313767 0.205432 0.011417
C  0.159954 1.759253 -0.826786
C  -1.068258 -1.031703 1.04516
C  -6.107837 1.223171 0.85804
C  2.33287 -2.883131 -1.048684
C  4.412444 0.079127 1.42201
C  1.070898 -3.245369 -1.833571
C  4.757915 0.805083 2.718274
H  0.566146 0.857346 1.108682
H  -3.996216 -2.243043 -0.39267
H  -2.960247 -0.928987 -0.99973
H  -3.4477 0.410902 1.109374
H  -4.485321 -0.904222 1.698892
H  -2.448101 -2.54295 1.601067
H  -1.641605 -2.811149 0.020525
H  -4.938932 0.699548 -0.907821
H  -5.990356 -0.607322 -0.323951
H  -5.461343 2.062367 1.177026
H  -6.955801 1.647133 0.289706
H  -6.515207 0.749318 1.771048
H  2.744371 -3.750288 -0.505182
H  3.108256 -2.457702 -1.713031
H  5.018556 0.439748 0.569749
H  4.53138 -1.016804 1.519864
H  0.654367 -2.360163 -2.345145
H  0.29798 -3.664572 -1.166173
H  1.315613 -4.00547 -2.599453
H  4.1206 0.448236 3.544662
H  4.610682 1.892392 2.605755
H  5.815277 0.618778 2.982661
