program: TURBOMOLE
programVersion: 7.3
elementType: f
basis: def2-TZVP
elementType: v
elementType: o
elementType: c
elementType: h
method: uhf
method: dft
functional: pbe0
elementType: f v o c h
basis: def2-TZVP def2-TZVP def2-TZVP def2-TZVP def2-TZVP
correction: disp3
energy: -8376.842517365 hartree
formula: C28H72FO20V6
InChI: InChI=1/2C2H6O.12C2H5O.F.6O.6V/c14*1-2-3;;;;;;;;;;;;;/h2*3H,2H2,1H3;12*2H2,1H3;;;;;;;;;;;;;/q;;;;;;;;;;;;2*-1;;;;;;;;;;;;2*+1/rC28H72FO20V6/c1-15-36-50(30,37-16-2)40(19-5)52(32,41(50)20-6)44(23-9)54(34,45(52)24-10)29-55(35,48(54)27-13,49(54)28-14)46(25-11)53(33,47(55)26-12)42(21-7)51(31,38-17-3,39-18-4)43(53)22-8/h36,38H,15-28H2,1-14H3
127 atoms
F  -1.14695225 -0.53933969 0.12354525
V  3.59900248 -0.81064708 -0.08457387
V  -3.18468685 0.02617649 0.35366066
V  1.17743233 3.40622536 -0.39985064
V  -1.84268477 -2.50737201 0.02556569
V  -1.79416579 2.7943307 0.37103255
V  1.23409502 -2.89785726 -0.14262764
O  4.99904513 -1.5257071 -0.05629528
O  1.58212228 4.93321235 -0.45765782
O  -2.62524607 -3.87533997 -0.15541554
O  -2.60544207 4.0541041 0.85496456
O  1.83905837 -4.34890078 -0.17583143
O  2.47220683 -1.84591077 -1.33545998
O  -2.42645504 1.38780125 1.59074957
O  1.79979039 2.23737632 -1.7731483
O  -2.86382497 -1.59719707 1.50646421
O  3.82533679 0.69318973 1.14369165
O  -3.09746098 -1.35547526 -1.12615635
O  -0.66074274 3.53709711 -1.11942716
O  -0.2569856 -3.01149801 1.14960524
O  0.08126947 2.63719746 1.02367999
O  -0.31637738 -2.70412973 -1.2819835
O  -2.70479463 1.58681028 -0.82429898
O  2.25785991 -1.66442144 1.04655889
C  2.96480703 -2.21922623 -2.60675857
H  2.11904996 -2.49265462 -3.24380422
H  3.43396865 -1.33788777 -3.05791619
C  1.05737928 1.80350119 -2.90074776
C  -3.74428903 -2.12009046 2.46096903
H  0.37847365 2.59961487 -3.21687413
H  1.7673978 1.63885325 -3.72336923
H  -3.19826964 -2.84414608 3.08243588
C  4.61203398 0.68873983 2.30483669
C  -4.3132592 -1.84907257 -1.63728715
H  4.28483841 1.5160474 2.95179843
H  -4.96326244 -0.99628251 -1.87055066
H  4.44935084 -0.23265061 2.87646497
H  -4.83249349 -2.44337614 -0.87793275
C  -1.05519469 4.52949701 -2.04396229
C  -0.37244975 -3.86551817 2.26283751
H  -1.97506762 4.19652894 -2.5386515
H  0.52641169 -3.77097871 2.88326607
H  -0.28167899 4.60446819 -2.81973119
H  -1.21372042 -3.51318061 2.87074377
C  0.56016328 1.66759564 1.94972303
C  -0.5235412 -2.83363149 -2.66320365
H  -1.46236172 -2.33096638 -2.90852236
H  1.39869485 1.13036165 1.50017181
H  0.26215399 -2.30176959 -3.20700624
C  -3.00713842 1.64512255 -2.19394503
C  2.10008497 -1.55397119 2.44376944
H  -2.18450474 2.13709916 -2.72330312
H  1.04109019 -1.68972174 2.67471504
H  -3.0601088 0.61765546 -2.56861479
H  2.36715567 -0.53830619 2.74493252
O  -4.75457583 0.17128523 0.5078647
C  -2.67932484 1.48780491 2.96665163
H  -1.93557834 2.15600565 3.41816765
H  -2.5376103 0.4957806 3.41469105
H  -4.0545041 -1.30328909 3.12747937
H  -0.22744621 0.92799643 2.09950567
O  2.95260053 2.92265615 0.60157736
C  4.02163432 3.85428628 0.66221024
C  3.88580887 4.76756882 1.85742817
H  4.96001534 3.2925629 0.70852062
H  4.02394151 4.43916065 -0.2604858
O  3.64730316 0.64420735 -1.5248678
C  4.85561699 1.35890456 -1.75357081
H  5.34201069 1.55621399 -0.79341869
C  5.77070133 0.56787807 -2.65591795
H  4.59102069 2.32284598 -2.19985964
H  2.83063198 1.33133707 -1.58400888
H  3.3061465 1.96336772 0.81945818
C  0.29113179 0.53913409 -2.60125177
H  -0.28313209 0.22038611 -3.47551273
H  0.97110972 -0.26666739 -2.32341688
H  -0.40091864 0.67267103 -1.7688063
C  -1.2776945 5.88595488 -1.41109004
H  -2.05713949 5.8249657 -0.65095324
H  -0.35805356 6.24132324 -0.94589253
H  -1.58497777 6.6008026 -2.18048484
C  -4.3160447 2.37011277 -2.41662935
H  -5.11550628 1.86243606 -1.87262676
H  -4.25449232 3.39584376 -2.04289079
H  -4.5694511 2.39765565 -3.48043293
C  -4.10482278 -2.69318844 -2.87569827
H  -3.61864297 -2.11577427 -3.66720616
H  -3.48817053 -3.5624302 -2.64060216
H  -5.0689148 -3.0469746 -3.25369392
C  -0.56507448 -4.29138981 -3.06302639
H  -1.35040727 -4.80416181 -2.50364821
H  -0.7627897 -4.39599296 -4.13381477
H  0.38651675 -4.77633752 -2.82934469
C  3.94185885 -3.37235867 -2.5371405
H  3.46571713 -4.24319323 -2.08347988
H  4.27722932 -3.63365807 -3.5451146
H  4.8102224 -3.10528548 -1.93289544
C  6.0922924 0.81572368 2.00263291
H  6.31575921 1.76545861 1.5097509
H  6.67670327 0.7680023 2.92606495
H  6.40547768 0.0016276 1.34614037
C  0.98994541 2.32107379 3.24030442
H  0.15943264 2.86342717 3.69712384
H  1.33890737 1.56412768 3.94838104
H  1.80067369 3.02779131 3.0559047
C  -4.07364559 2.00937831 3.23773392
H  -4.18669765 3.00254542 2.7982388
H  -4.8149745 1.34882587 2.7837729
H  -4.25677342 2.07209438 4.3145925
C  -4.97260404 -2.7851093 1.87579526
H  -5.59962729 -3.18671764 2.67835754
H  -5.55228621 -2.05625339 1.30716158
H  -4.67587346 -3.60200908 1.21546752
C  -0.57005208 -5.3150071 1.87418996
H  -1.47785952 -5.42447916 1.2796707
H  0.27839909 -5.66162687 1.28132299
H  -0.65199584 -5.93389446 2.7729738
C  2.96264573 -2.57237509 3.15545746
H  2.82969578 -2.50484351 4.23870513
H  2.70484003 -3.58327979 2.83156758
H  4.01808742 -2.41372345 2.91933435
H  5.30306921 0.39482115 -3.62763757
H  6.00071463 -0.39795574 -2.20075983
H  6.70758815 1.10891476 -2.81174779
H  2.93536084 5.30093831 1.80526619
H  4.69676495 5.50106353 1.86905247
H  3.92316825 4.19873244 2.7898058
empdispcorrection: -0.177383454 hartree
energy: -8376.8425173650121
energyOcCorr: -8376.8462050797
elementType: f v o c
s2: 12.07455948
charge: -1.000000
dipole: 140.595809 -137.513797 3.082012 49.141225 -48.065955 1.075270 -16.470045 16.076058 -0.393987
quadrupole: 17079.210612 -17423.319440 -344.108828 14603.746566 -14969.569183 -365.822617 6044.402600 -6324.974739 -280.572139 953.908817 -938.989554 14.919263 -287.020682 293.592611 6.571929 136.833242 -144.277365 -7.444123
