program: TURBOMOLE
programVersion: 7.3
elementType: v
basis: def2-TZVP
elementType: o
elementType: c
elementType: h
method: uhf
method: dft
functional: pbe0
elementType: v o c h
basis: def2-TZVP def2-TZVP def2-TZVP def2-TZVP
correction: disp3
energy: -8276.892668298 hartree
formula: C28H72O20V6
InChI: InChI=1/2C2H6O.12C2H5O.6O.6V/c14*1-2-3;;;;;;;;;;;;/h2*3H,2H2,1H3;12*2H2,1H3;;;;;;;;;;;;/q;;;;;;;;;;;;2*-1;;;;;;;;;;;2*+1/rC28H72O20V6/c1-15-35-49(29,36-16-2)39(19-5)51(31,40(49)20-6)43(23-9)53(33,44(51)24-10)47(27-13)54(34,48(53)28-14)45(25-11)52(32,46(54)26-12)41(21-7)50(30,37-17-3,38-18-4)42(52)22-8/h35,37H,15-28H2,1-14H3
126 atoms
V  3.70223144 0.35207166 0.08490907
V  -3.37977207 0.60718016 -0.37966585
V  0.54170239 -3.35056798 -0.10581606
V  -1.45855902 2.97590863 0.30606808
V  -2.39069716 -2.36551067 -0.60394716
V  1.64795435 2.66377535 0.62269715
O  5.18118436 0.86450626 0.15082834
O  0.82087598 -4.89778567 -0.07374947
O  -2.04815359 4.40787866 0.55533908
O  -3.46236774 -3.44936674 -0.96570522
O  2.39584286 3.93687295 1.14433145
O  2.61357177 1.16948704 1.5360193
O  -2.92803334 -0.79215089 -1.72895292
O  1.35259547 -2.2991202 1.25297261
O  -2.15984035 1.92777004 -1.20068493
O  3.60627048 -0.87656885 -1.41214095
O  -2.84658958 1.79440839 1.12253096
O  -1.2552841 -3.28088871 0.74932441
O  0.2575008 3.37842007 -0.62945715
O  -0.62749665 -2.5414382 -1.47464082
O  -0.07562797 2.2979675 1.5184165
O  -2.93551924 -0.98884201 0.68569353
O  2.552897 1.68542304 -0.81531848
C  3.09319238 1.19054533 2.87561127
H  2.2832513 1.5304197 3.52715671
H  3.33133869 0.15989094 3.15668576
C  0.89614725 -2.09136178 2.57134059
C  -1.94726563 2.17338424 -2.57815398
H  -0.93457353 2.56622309 -2.70186523
H  1.19327593 -1.08019378 2.87374607
H  -0.19607542 -2.12516846 2.58850718
H  -1.98461392 1.21909742 -3.10799267
C  4.41481696 -0.81564758 -2.56287379
C  -3.71703003 2.24443952 2.15400105
H  4.48106884 0.21572522 -2.92951074
H  -3.10370098 2.71833633 2.92959474
H  -4.19334494 1.36853566 2.60854647
H  3.92896425 -1.39760255 -3.35901987
C  -1.72903012 -4.26272512 1.66162915
C  0.38633035 4.54576341 -1.43447463
H  -2.62260187 -3.86735438 2.15767825
H  1.24696931 4.41424956 -2.09873437
H  -0.96519812 -4.40096527 2.43522064
H  -0.502527 4.61480368 -2.07242058
C  -0.22396071 -1.89363385 -2.67147645
C  -0.28439569 1.7837699 2.81986259
H  -1.276391 1.32919858 2.85051748
H  -1.08094007 -1.86081777 -3.34726128
H  0.43822453 0.98293591 2.98951072
C  -3.08293098 -1.13463996 2.08453218
C  2.57419098 2.0218026 -2.18780304
H  -2.34547358 -1.85917147 2.43367454
H  1.59632047 2.43026624 -2.45315623
H  -2.83878898 -0.18101013 2.55574429
H  2.69648304 1.10186887 -2.76140431
O  -4.90605517 0.88973115 -0.58976597
C  -3.61180377 -0.93004714 -2.96869093
H  -3.0511203 -1.63764425 -3.59024058
H  -3.58789809 0.03733589 -3.48314553
H  0.54686198 -2.50477011 -3.14506906
O  2.23780042 -2.94673144 -1.25245781
C  3.03416241 -4.02150121 -1.75317531
H  3.11317687 -4.78006202 -0.97165112
C  2.43363754 -4.61544588 -3.00303801
H  4.03502131 -3.62901407 -1.95164013
O  3.61413877 -1.33836177 1.22306262
C  4.61191168 -2.35523357 1.15505365
C  5.80755431 -1.95801033 1.98170212
H  4.16288656 -3.28385751 1.5211761
H  4.89394727 -2.50786821 0.11011036
H  2.65990765 -1.7775459 1.19867232
H  2.7883476 -2.06929268 -1.29278529
C  1.48170562 -3.11067167 3.52379711
H  2.57038028 -3.02448161 3.5605245
H  1.09392457 -2.96413803 4.53511621
H  1.23413651 -4.12429037 3.19926904
C  -2.05844569 -5.5835756 1.0061112
H  -1.17272094 -6.01365513 0.53962668
H  -2.42895394 -6.27942242 1.76362261
H  -2.83127199 -5.44938085 0.2485976
C  -4.48646913 -1.57264528 2.42707754
H  -4.71532234 -2.5288911 1.95029603
H  -4.60310408 -1.68366234 3.50781332
H  -5.21372004 -0.83930027 2.06982528
C  -4.77652482 3.20536973 1.66825644
H  -5.40201027 2.73209523 0.91055304
H  -5.40979537 3.50027042 2.50912821
H  -4.3187294 4.09977078 1.24608441
C  -0.15503224 2.87789746 3.85211438
H  -0.89885335 3.65833756 3.67434795
H  -0.30248228 2.47834482 4.85841668
H  0.83227037 3.34332568 3.8003863
C  4.29727061 2.08438998 3.06204169
H  4.59494429 2.07729678 4.11388018
H  5.13770507 1.73961061 2.45850823
H  4.0616474 3.10899978 2.77102831
C  5.82035041 -1.32562108 -2.32016169
H  5.8234981 -2.38104066 -2.037201
H  6.42377497 -1.21859702 -3.22533683
H  6.29072102 -0.7503917 -1.5202117
C  3.68511025 3.00133652 -2.48189062
H  3.69997314 3.26139261 -3.5432001
H  3.5555013 3.91628226 -1.89875915
H  4.65277437 2.57213939 -2.21112773
C  0.54341349 5.82016061 -0.63853185
H  -0.32167697 5.97910654 0.0052363
H  1.44147613 5.78366692 -0.02190519
H  0.62499605 6.66487457 -1.32780087
C  -2.98333282 3.13368206 -3.10972427
H  -2.81959369 3.32693399 -4.17256605
H  -3.98671543 2.72118143 -2.97899072
H  -2.93749034 4.08320279 -2.57075839
C  -5.04177461 -1.39782645 -2.82768019
H  -5.62278259 -0.68810373 -2.23854952
H  -5.49214373 -1.47872361 -3.82062189
H  -5.0807763 -2.37526786 -2.34697377
C  0.29061289 -0.5043532 -2.39353096
H  -0.45472562 0.07254307 -1.84622567
H  1.21003442 -0.53351939 -1.80935519
H  0.5071661 0.01583589 -3.32976679
H  3.0365165 -5.46032885 -3.34431038
H  2.39092006 -3.87881107 -3.8088515
H  1.42458484 -4.97922744 -2.79948489
H  6.22043925 -1.0149726 1.61796396
H  6.582754 -2.72453793 1.91510764
H  5.53082562 -1.83439948 3.03081511
empdispcorrection: -0.172589493 hartree
energy: -8276.8926682981692
energyOcCorr: -8276.8925421147
elementType: v o c
s2: 12.07323185
charge: -0.000000
dipole: 124.009203 -122.935541 1.073663 -38.683417 37.682403 -1.001014 -7.182574 6.874633 -0.307941
quadrupole: 16865.294292 -17177.874913 -312.580621 14208.273456 -14528.870967 -320.597510 6303.819088 -6559.150720 -255.331631 -618.475688 601.982559 -16.493129 373.966266 -386.589749 -12.623484 606.828751 -619.515288 -12.686538
