program: Gaussian 09
title: 000050160
version: EM64L-G09RevD.01
frameworkgroup: C1[X(C20H14O3)]
method: RPBEPBE
basis: SDD
operation: Freq
keyword: #pfreq=noraman
keyword: PBEPBE/SDD
title: #p freq=noraman PBEPBE/SDD
converged: YES YES NO NO
title: Mulliken charges:
elementType: O O O C C C C C C C C C C C C C C C C C C C C H H H H H H H H H H H H H H
charge: -0.301550 -0.444387 -0.440455 -0.188540 -0.285248 -0.172611 0.438941 -0.241819 0.043824 0.266279 -0.742063 0.009790 0.494272 -0.003476 -0.417216 0.490670 -0.497863 0.476706 -0.510465 -0.479932 -0.464458 -0.461458 -0.241946 0.241143 0.244642 0.259115 0.257270 0.255418 0.366360 0.256478 0.345589 0.245411 0.240016 0.240667 0.246686 0.243842 0.230365
chargesum: 0.00000
title: Mulliken charges with hydrogens summed into heavy atoms:
elementType: O O O C C C C C C C C C C C C C C C C C C C C
charge: -0.301550 -0.078027 -0.094866 0.052603 -0.040605 0.086504 0.438941 0.015451 0.043824 0.266279 -0.486645 0.009790 0.494272 -0.003476 -0.160739 0.490670 -0.252451 0.476706 -0.270449 -0.239265 -0.217772 -0.217616 -0.011581
polarizability: 3.81650524e+02 1.17590281e+01 2.41460451e+02 -1.44983773e+01 -5.16325147e+00 1.10791901e+02
1716.lowfreq: -0.0007 -0.0007 -0.0005 4.0475 9.3090 13.4227 40.3097 49.9156 67.5611
frequency: 40.2969 49.8226 67.5563 122.9109 140.3838 163.8964 175.0241 202.6071 216.1490 229.6395 242.7438 296.8559 310.9781 336.8703 369.1241 402.0693 426.0566 445.8781 465.9896 483.7172 495.7344 504.7452 512.0568 522.7748 532.4015 540.1519 564.1120 576.0812 593.0359 632.9957 647.4539 670.6585 693.7003 711.8942 745.0760 751.7777 771.2036 785.4940 810.4599 821.9776 832.2190 840.1945 857.5690 864.0466 868.1416 909.4681 920.3684 926.5890 972.4877 978.4226 987.1783 991.6948 993.4942 996.1990 1011.6607 1069.9995 1088.0768 1091.4905 1120.4575 1140.9664 1173.6340 1178.5318 1190.7642 1196.9520 1219.1972 1221.4987 1230.5096 1239.2671 1258.4267 1269.3861 1282.3497 1329.0452 1330.4280 1336.8894 1343.0883 1370.8147 1384.5276 1397.6973 1406.0917 1425.7123 1430.3386 1435.4863 1444.6015 1469.4387 1491.1682 1497.9842 1559.5150 1591.2282 1607.6913 1609.0068 1637.0207 3058.6256 3068.2766 3107.0065 3122.1305 3123.8073 3125.6223 3131.1528 3134.7959 3135.7632 3147.0274 3159.1655 3171.3004 3437.9468 3558.9074
redmass: 6.3954 5.9792 5.9703 6.0498 6.5043 4.4043 1.3243 3.5149 3.8984 5.5514 4.6809 7.0138 5.3731 5.4310 5.0243 3.7910 6.1635 5.0174 6.2064 4.1875 1.3585 5.1684 4.0400 4.1739 4.1331 3.5119 3.7532 5.4662 5.7749 5.4092 6.7635 5.1218 4.0324 3.7749 4.6120 4.1434 1.2676 4.2281 4.6887 2.6046 2.1500 2.8785 5.3888 3.1533 2.2030 1.6010 2.1617 2.7398 3.7637 1.3712 1.4444 2.9091 1.4351 3.5616 3.5270 1.7929 1.4165 1.9307 2.4944 1.6347 1.3862 1.2418 1.4684 1.2841 1.7266 1.2126 1.4816 1.6379 1.8700 1.6629 1.8166 1.5817 1.7608 1.6463 1.4996 2.4231 3.4576 1.9822 1.7743 2.9240 4.6599 5.8248 3.2038 4.1768 7.6690 3.5546 5.3181 7.2753 6.5683 6.6051 7.4689 1.0861 1.0859 1.0889 1.0881 1.0897 1.0862 1.0893 1.0916 1.0941 1.0983 1.0990 1.0947 1.0649 1.0668
irintensity: 0.7086 1.2737 0.3674 1.6927 21.9998 1.7132 109.7877 4.9239 9.6684 6.3279 1.6460 6.2168 0.5181 0.4274 2.8261 0.2813 11.5338 6.9733 2.0093 17.7818 93.3460 4.7940 0.2000 8.5581 7.7571 18.2440 6.7623 2.0050 0.5129 5.3608 60.8292 5.2184 0.4876 13.8384 12.5597 14.8678 9.8347 5.6081 5.5885 18.0012 22.3257 4.5666 5.4989 26.1908 85.1277 38.8576 82.8129 37.9305 2.6409 2.2286 0.0631 1.0868 3.8257 56.6529 24.0439 0.4006 6.5851 5.2386 0.1900 3.3172 23.3631 23.7119 0.1980 18.4782 16.5627 20.8598 27.8038 2.4284 6.3478 13.7107 1.1243 23.0646 28.1090 17.2605 29.0538 50.2186 8.8730 11.1877 27.3910 2.3700 0.3189 0.5718 1.0566 7.4611 0.2348 0.4265 2.0588 5.8537 4.5455 8.4787 0.7219 22.0878 12.8891 9.6234 1.5117 7.2092 0.2622 4.0966 17.6921 43.9916 30.8647 40.6782 10.2061 23.4465 10.2825
temp: 298.150 k
press: 1.00000 atm
elementType: 8 8 8 6 6 6 6 6 6 6 6 6 6 6 6 6 6 6 6 6 6 6 6 1 1 1 1 1 1 1 1 1 1 1 1 1 1
symmnumber: 1
zpe: 745111.4 jmol-1
zpe.correction: 0.283798 hartree
zpe.thermalcorrener: 0.300774 hartree
zpe.thermalcorrenthalpy: 0.301718 hartree
zpe.thermalcorrgfe: 0.239715 hartree
zpe.sumelectzpe: -994.626603 hartree
zpe.sumelectthermal: -994.609627 hartree
zpe.sumelectthermalent: -994.608683 hartree
zpe.sumelectthermalfe: -994.670687 hartree
dipole: -3.2026 2.1593 -2.6446
dipole: 4.6812
quadrupole: -123.1079 -123.7272 -138.9945
quadrupole: 6.4807 -12.8911 -4.1748
quadrupole: 5.5020 4.8826 -10.3846 6.4807 -12.8911 -4.1748
hfenergy: -994.9104013 hartree
pointgroup: C01 [X(C20H14O3)]
dipole: 1.2363103 -0.8917941 -1.0335271 debye
polarizability: 382.2294619|8.9826476|241.1377611|13.0922466|2.853856|110.5356522 unknown
InChI: InChI=1S/C20H14O3/c21-17-16-12-7-6-10-3-1-2-9-4-5-11(15(12)14(9)10)8-13(16)19-20(23-19)18(17)22/h1-8,17-22H
charge 0 multiplicity 1
37 atoms
O  -4.202603 -1.420813 0.86641
O  -4.026286 1.108144 1.768753
O  -2.767801 2.014057 -1.613781
C  -4.433172 -0.347291 -0.182771
C  -3.354335 -1.357203 -0.421581
C  -4.015508 1.049621 0.305317
C  -1.922169 -0.972461 -0.269816
C  -2.624438 1.478295 -0.22824
C  -1.552013 0.400951 -0.174222
C  -0.166373 0.749534 -0.092211
C  -0.941787 -1.987982 -0.255461
C  0.833935 -0.293041 -0.061283
C  0.434666 -1.678141 -0.13541
C  2.229974 0.037638 0.035333
C  0.285316 2.127179 -0.060655
C  2.64425 1.417097 0.088087
C  1.450023 -2.709102 -0.096622
C  3.224115 -1.00798 0.074856
C  1.628254 2.443857 0.028604
C  2.790215 -2.387263 0.008201
C  4.027927 1.725881 0.186005
C  4.597394 -0.656705 0.174728
C  4.992483 0.697082 0.230905
H  -5.391599 -0.445253 -0.70287
H  -3.563082 -2.216174 -1.071404
H  -4.737296 1.803181 -0.050882
H  -2.337129 2.351419 0.378347
H  -1.251016 -3.037964 -0.328193
H  -3.896276 0.172076 2.091157
H  -0.452654 2.930373 -0.129475
H  -2.528517 1.299844 -2.257808
H  1.13132 -3.756507 -0.149542
H  1.945393 3.493043 0.049886
H  3.551106 -3.175736 0.040804
H  4.340717 2.77564 0.225779
H  5.35171 -1.451431 0.20715
H  6.055159 0.950537 0.308105
