program: TURBOMOLE
programVersion: 7.3
title: Local memory allocated for RDGRAD: 1 MiB
elementType: c
basis: def2-TZVP
elementType: h
elementType: o
method: uhf
method: dft
functional: pbe0
elementType: c h o
basis: def2-TZVP def2-TZVP def2-TZVP
correction: disp3
frequency: -0.00 -0.00 0.0000 0.0000 0.0000 0.0000 129.40 233.52 265.25 276.68 464.25 770.00 899.86 905.04 1063.06 1084.00 1114.59 1182.82 1264.13 1267.49 1322.05 1347.31 1408.74 1457.79 1486.53 1492.61 1500.87 1519.18 2977.84 3006.86 3043.23 3053.51 3088.69 3116.33 3126.13 3877.47
irintensity: 0.00000 0.00000 0 0 0 0 5.71751 6.17462 111.71442 4.04640 10.53937 1.01332 5.21616 2.22048 14.57296 70.48070 29.21922 0.94192 45.32988 0.67316 0.20110 9.51380 1.73147 2.24666 0.83714 8.88201 6.36562 4.81051 60.10623 46.51122 23.43916 29.66658 3.24405 57.12208 28.40026 30.86436
energy: -194.2026338835 hartree
formula: C3H8O
InChI: InChI=1/C3H8O/c1-2-3-4/h4H,2-3H2,1H3
12 atoms
C  -3.2012879 0.33880999 0.00503404
H  -2.84835289 -0.69512799 -0.04600111
H  -2.83991638 0.85478928 -0.8864824
H  -4.29362843 0.31780999 -0.04569425
C  -2.71898622 1.02573711 1.27089625
H  -1.62534866 1.05350892 1.2981226
H  -3.05877112 2.06568307 1.29547283
C  -3.2098412 0.33270563 2.52018727
H  -2.86766669 -0.71330168 2.5191807
H  -4.3102367 0.31771388 2.52468431
O  -2.70810482 1.02850028 3.6443469
H  -3.02068462 0.59377986 4.44043964
converged: yes
nucrepener: 130.933238140 hartree
empdispcorrection: -0.003433488 hartree
orbitalenergy: -10.3861 -10.2261 -9.4178 -9.1300 -7.7742 1.1698 1.4249 2.6479 2.6637 2.9813 electronvolt
s2: 0.00000000
charge: 0.000000
dipole: -191.448487 191.112217 -0.336270 41.963982 -42.430374 -0.466393 119.111758 -119.074788 0.036971
quadrupole: 1103.007921 -1119.297021 -16.289100 84.928374 -106.417699 -21.489324 680.790581 -698.240201 -17.449619 -224.591116 226.420271 1.829155 -653.746811 650.840086 -2.906725 170.674171 -174.378440 -3.704269
