program: TURBOMOLE
programVersion: 7.3
title: Local memory allocated for RDGRAD: 20 MiB
elementType: v
basis: def2-TZVP
elementType: o
elementType: c
elementType: h
elementType: cl
method: uhf
method: dft
functional: pbe0
elementType: v o c h cl
basis: def2-TZVP def2-TZVP def2-TZVP def2-TZVP def2-TZVP
correction: disp3
energy: -9287.002774372 hartree
formula: C42H100ClO20V6
InChI: InChI=1S/2C3H8O.12C3H7O.Cl.6O.6V/c14*1-2-3-4;;;;;;;;;;;;;/h2*4H,2-3H2,1H3;12*2-3H2,1H3;;;;;;;;;;;;;/q;;;;;;;;;;;;2*-1;;;;;;;;;;;;;+2
169 atoms
V  -0.98821341 -3.13690587 -0.11219002
V  1.67402736 2.74013405 -0.23509547
V  -3.32429644 -1.06887455 0.13099345
V  3.34352615 0.21760291 0.0147741
V  -3.09189256 2.03371197 0.53659625
V  2.0786386 -2.59371234 -0.08215177
O  -1.45341758 -4.63229616 -0.22612653
O  -4.75296492 -1.71415992 -0.00805329
O  4.90117841 0.31871777 0.21521888
O  -4.45390316 2.81674733 0.66957705
O  2.99797828 -3.87050791 -0.15473331
O  0.59273189 -3.20565258 1.10483652
O  -2.11456225 3.1772962 -0.74692972
O  -2.08384498 -2.15325708 1.19335405
O  2.83493726 1.56266587 -1.35693459
O  -2.30015252 -2.1208354 -1.23315306
O  2.70071621 1.74477052 1.13828648
O  -3.51528615 0.31878996 1.55059076
O  3.0504149 -1.29871015 -1.23121987
O  -3.1454287 0.61188397 -0.84220566
O  2.76423917 -1.28060289 1.1974367
O  -1.79274827 2.60068704 1.84998855
O  0.53807564 -2.7682846 -1.29322705
O  2.45724018 4.09084742 -0.43913362
C  2.43639367 -1.09028586 2.55416358
C  3.6758269 -1.25311834 3.41474048
H  1.66324048 -1.80737811 2.84439021
H  1.9967789 -0.09661967 2.67101709
C  4.24571341 -2.66121866 3.38081727
H  4.43307425 -0.55023044 3.05152063
H  3.43014289 -0.95832911 4.44193122
H  4.40112351 -2.98461988 2.34904612
H  5.20492095 -2.71584755 3.90151353
H  3.56886964 -3.37527306 3.85891711
C  -1.63946593 2.14378321 3.16891315
C  -0.5060475 1.14647159 3.31310903
H  -2.56542446 1.68202875 3.52247599
H  -1.45916805 3.0105027 3.82550168
C  -0.40869511 0.59149872 4.72160092
H  -0.6588684 0.34782069 2.58505991
H  0.43368491 1.62348583 3.02130012
H  0.41818769 -0.11745107 4.81084913
H  -0.24448675 1.38486558 5.45824354
H  -1.32619291 0.06548485 5.00462843
C  -1.92703183 -2.20234317 2.59441401
C  -2.51576102 -3.48154422 3.15868022
H  -2.41088135 -1.32312773 3.02714434
H  -0.86023694 -2.12692229 2.82318881
C  -4.01968643 -3.58731049 2.97133258
H  -2.02984574 -4.32940853 2.66395081
H  -2.25316894 -3.53944766 4.22171635
H  -4.2888145 -3.48175202 1.9187939
H  -4.39360493 -4.55243909 3.32133322
H  -4.54544664 -2.80515531 3.52620597
C  -4.50446675 0.30129208 2.55814326
C  -5.93399944 0.32372903 2.05234316
H  -4.35626747 1.17474204 3.205374
H  -4.35669234 -0.58711989 3.18720217
C  -6.91315114 0.36658314 3.21374391
H  -6.05685654 1.20118012 1.41343068
H  -6.11100597 -0.55839897 1.43516056
H  -7.94621562 0.37662349 2.85879399
H  -6.79810732 -0.50547882 3.86597108
H  -6.76574215 1.2605546 3.82778123
C  3.29744533 2.2508613 2.30083061
C  4.46157165 3.17862812 2.01488185
H  3.6484108 1.41332099 2.91433546
H  2.53400986 2.77012766 2.89564408
C  5.08117871 3.70653499 3.29708145
H  5.19723972 2.62292286 1.42662076
H  4.10974305 4.00128105 1.38611844
H  5.92303392 4.3708257 3.08889167
H  4.35253281 4.27151208 3.88743371
H  5.45087009 2.89030621 3.92539519
C  0.87081454 -4.15083548 2.11842887
C  0.90229413 -5.58760111 1.63937208
H  0.13155352 -4.04448835 2.92202173
H  1.8462552 -3.90687671 2.55314912
C  1.2827924 -6.52405422 2.77398499
H  -0.07371418 -5.85328974 1.22875154
H  1.62618805 -5.65895654 0.82398546
H  0.57061603 -6.45690771 3.60282733
H  1.30110207 -7.56362856 2.43925364
H  2.274834 -6.28610473 3.17006436
C  0.44133003 -2.37544215 -2.6445351
C  0.27271278 -3.59385322 -3.53253102
H  1.33777409 -1.8103033 -2.91046094
H  -0.40307369 -1.68942167 -2.74671221
C  1.47272725 -4.5254901 -3.50514405
H  -0.61586183 -4.1392358 -3.19595329
H  0.06846597 -3.25405243 -4.55493688
H  1.27193071 -5.44783447 -4.05548349
H  2.35059107 -4.05467449 -3.95638157
H  1.73005602 -4.79155595 -2.47768922
C  3.58169012 2.03082747 -2.45030757
C  4.91152913 2.64433855 -2.06074779
H  2.9851154 2.78048865 -2.98452973
H  3.74510175 1.20285926 -3.15371735
C  5.66425655 3.15151789 -3.2785988
H  4.714683 3.46008224 -1.36046871
H  5.50110499 1.89700856 -1.52427457
H  5.86472574 2.34246154 -3.98846214
H  5.09325636 3.92072587 -3.80772251
H  6.6253836 3.58820389 -2.99774448
C  -3.1081675 0.78733425 -2.23670166
C  -4.50574115 0.86553012 -2.81375939
H  -2.54792483 -0.03894666 -2.68416464
H  -2.562629 1.70816836 -2.45165472
C  -4.48039133 0.94558374 -4.33002209
H  -5.07450053 -0.00984746 -2.48158351
H  -5.00721343 1.73899492 -2.38472754
H  -4.00218265 0.06123674 -4.76240372
H  -5.48843634 1.01544312 -4.74460805
H  -3.92045182 1.82133101 -4.67137305
C  -2.3291016 4.56541401 -0.67995461
C  -3.51083045 5.00894158 -1.52419086
H  -1.41741238 5.07583565 -1.02404423
H  -2.4953135 4.87330323 0.36057913
C  -3.32183221 4.73771599 -3.00611531
H  -4.40282612 4.49624222 -1.15309385
H  -3.66455278 6.08176437 -1.35487428
H  -3.19916513 3.66838924 -3.18698848
H  -4.18104591 5.0757715 -3.59137968
H  -2.43111271 5.24409745 -3.39196656
C  -2.9698167 -2.56306363 -2.39767033
C  -3.7212396 -3.8676162 -2.2314121
H  -2.24546285 -2.65327689 -3.21646287
H  -3.68627825 -1.79090039 -2.69879051
C  -4.47619531 -4.21634065 -3.50320175
H  -3.02033297 -4.66185039 -1.96819106
H  -4.41208869 -3.75846247 -1.39172513
H  -5.20395379 -3.44018891 -3.75943641
H  -3.79550236 -4.3247677 -4.35384221
H  -5.02007964 -5.1573063 -3.39472118
C  3.89651204 -1.65419909 -2.29756339
C  5.2423634 -2.18802237 -1.84958515
H  4.03981083 -0.77737197 -2.94142843
H  3.39348076 -2.41547426 -2.90594389
C  6.10500471 -2.57047507 -3.04006486
H  5.73637443 -1.42670657 -1.24118529
H  5.06773718 -3.05315952 -1.20507275
H  5.62650259 -3.3463025 -3.64609425
H  6.29040728 -1.71010604 -3.69118552
H  7.07555744 -2.95521259 -2.7188107
O  0.17391231 2.97593049 -1.56512101
O  0.36557309 3.47784747 1.14347691
H  -0.81981378 2.98881504 -1.16782425
H  -0.59685134 3.07738817 1.39341728
C  0.68176547 4.59674068 1.9464145
C  0.34570188 5.91765389 1.28674598
H  1.75381446 4.57425131 2.16342632
H  0.15194546 4.50183434 2.90274588
C  0.85754303 7.08938844 2.10680967
H  0.79953067 5.91719314 0.2923072
H  -0.73577455 5.99010633 1.15268372
H  0.42542589 7.09248496 3.11255676
H  1.94552306 7.04779486 2.21401433
H  0.60673428 8.04324293 1.63745244
C  0.14720324 2.70407865 -2.95143219
C  0.27171752 1.23300366 -3.29150104
H  0.95093096 3.27984419 -3.42514544
H  -0.79816401 3.0983812 -3.34536775
C  0.08328695 0.98609756 -4.7765254
H  1.23824368 0.86329717 -2.94765051
H  -0.46370986 0.68189495 -2.70657482
H  -0.91035428 1.30144258 -5.11173477
H  0.82155826 1.53203344 -5.37300774
H  0.18947826 -0.07525262 -5.01409574
Cl 0.35417024 0.29993092 -0.01172448
converged: yes
empdispcorrection: -0.231151826 hartree
orbitalenergy: -4.2364 -4.1658 -4.0680 -3.9253 -3.6307 1.0489 1.3080 1.3146 1.3334 1.3628 electronvolt
orbitalenergy: -5.1405 -4.9909 -4.8222 -4.6281 -4.3504 1.3997 1.5935 1.6754 1.7945 1.8923 electronvolt
s2: 12.07885858
charge: -1.000000
dipole: -43.518639 43.911425 0.392785 -1.217402 1.595832 0.378429 -6.104255 6.081600 -0.022655
quadrupole: 23332.891877 -23772.429071 -439.537194 20857.382408 -21280.806167 -423.423759 11627.650079 -12005.063042 -377.412962 452.973749 -448.976653 3.997096 -419.179972 421.767200 2.587228 206.589178 -207.362049 -0.772871
