program: TURBOMOLE
programVersion: 7.3
title: Local memory allocated for RDGRAD: 13 MiB
elementType: v
basis: def2-TZVP
elementType: o
elementType: c
elementType: h
elementType: f
method: uhf
method: dft
functional: pbe0
elementType: v o c h f
basis: def2-TZVP def2-TZVP def2-TZVP def2-TZVP def2-TZVP
correction: disp3
energy: -7131.883252168 hartree
formula: C30H70FO15V5
InChI: InChI=1S/10C3H7O.F.5O.5V/c10*1-2-3-4;;;;;;;;;;;/h10*2-3H2,1H3;;;;;;;;;;;
121 atoms
V  -2.33695329 0.93552617 0.31854626
V  0.12245994 2.56211789 0.0320723
V  1.38781263 -2.16343115 -0.12627531
V  2.39395766 0.6912903 -0.26477317
V  -1.65264352 -2.00873497 0.08802252
O  -3.81256743 1.44290184 0.54357664
O  2.25802576 -3.4747173 -0.17268283
O  3.922998 1.02586206 -0.45117183
O  -2.65932863 -3.21796913 0.10563755
O  -2.214618 -0.69530324 1.47127524
O  -1.22248795 2.12559412 1.42998386
O  2.10307179 -0.88094204 -1.46903128
O  -1.52550597 2.15298229 -1.0365146
O  1.71933614 1.98342487 1.10126434
O  -0.23701522 -2.45363785 -1.2146852
O  1.44120312 2.03147199 -1.36155195
O  -0.06617016 -2.48782824 1.16761929
O  2.35418389 -0.8519998 0.97242908
O  -2.48085439 -0.57067806 -0.96323371
C  -2.85945465 -0.44726409 -2.30676218
C  -4.32761835 -0.08267138 -2.42606663
H  -2.68468844 -1.39970179 -2.81804607
H  -2.23195312 0.3070417 -2.79242366
C  -5.23394277 -1.14036539 -1.82164892
H  -4.49331852 0.87338283 -1.91988599
H  -4.55601374 0.06716858 -3.48827485
H  -4.98827596 -1.28851669 -0.76930199
H  -6.2860659 -0.85276735 -1.89000696
H  -5.10906193 -2.10343002 -2.3260104
C  1.40853055 2.16506635 -2.75118524
C  0.45176239 1.20794935 -3.4356627
H  2.42744463 2.00889218 -3.13626319
H  1.13744212 3.20286367 -2.99536272
C  0.59163222 1.24111298 -4.94590272
H  0.63991555 0.20808821 -3.04197006
H  -0.56388538 1.46104951 -3.13312788
H  1.59727321 0.94211805 -5.25849183
H  -0.11867247 0.56304533 -5.42570796
H  0.40845121 2.2449512 -5.34295086
C  -2.19582708 3.10567466 -1.82077744
C  -2.90553271 4.18246744 -1.02262918
H  -2.92472865 2.58400277 -2.4586289
H  -1.46291444 3.57587369 -2.49236354
C  -3.60016419 5.17896646 -1.93472744
H  -3.62580079 3.70074674 -0.35659311
H  -2.16595965 4.68401096 -0.39361621
H  -4.34638266 4.68755497 -2.56763413
H  -4.1144884 5.9523534 -1.35929399
H  -2.88517108 5.67970972 -2.59531564
C  2.91028597 -1.14102877 -2.58861729
C  4.25429934 -1.74518214 -2.23433762
H  3.06656877 -0.19941986 -3.13152916
H  2.37125375 -1.81168486 -3.27159115
C  5.08792489 -2.01573389 -3.47479305
H  4.77075072 -1.05116414 -1.5658813
H  4.08172182 -2.66892373 -1.67481844
H  4.58162164 -2.71234962 -4.15077142
H  5.27960042 -1.09415011 -4.03314963
H  6.0554261 -2.45189297 -3.21565369
C  -0.30249234 -2.70390347 -2.59160856
C  0.49161557 -3.93927039 -2.97396884
H  0.05030821 -1.82706817 -3.14769044
H  -1.35149149 -2.86784598 -2.86474337
C  0.00454349 -5.18665293 -2.2593775
H  0.42052009 -4.05745969 -4.06195267
H  1.54772358 -3.7783877 -2.73656214
H  0.56123201 -6.07079776 -2.57929294
H  0.14094647 -5.07527016 -1.18341337
H  -1.05887192 -5.36207893 -2.44709891
C  -3.03590109 -0.91874176 2.58888873
C  -4.45099643 -1.32258655 2.22619945
H  -3.06011323 -0.00135217 3.19231122
H  -2.58149828 -1.6977367 3.21632169
C  -5.295501 -1.56511168 3.46514827
H  -4.88427833 -0.52829563 1.6127982
H  -4.40413368 -2.22398339 1.60847776
H  -6.31403577 -1.85784232 3.19999781
H  -4.87311808 -2.3623902 4.08512368
H  -5.36075951 -0.66476436 4.08401088
C  -1.12303208 2.19286752 2.82272668
C  -0.27043758 1.09646547 3.43205631
H  -2.1394444 2.15003704 3.24221382
H  -0.71360919 3.17717884 3.09370518
C  -0.31445514 1.11725775 4.94847717
H  -0.62328628 0.14157376 3.04017206
H  0.74972546 1.20890472 3.06687747
H  -1.33213431 0.96091617 5.32110148
H  0.31683457 0.33317729 5.37457944
H  0.03779826 2.07481255 5.34570129
C  2.50067357 2.87152431 1.85799529
C  3.27659489 3.88372729 1.03659309
H  3.20588009 2.28620571 2.46695632
H  1.83832041 3.40074322 2.55852385
C  4.09007556 4.80836251 1.92600038
H  3.92690603 3.34083709 0.34629718
H  2.56572445 4.45463217 0.43478962
H  4.81178453 4.24869387 2.52990633
H  4.65042076 5.53636497 1.33448993
H  3.44683486 5.36706008 2.61343559
C  2.68021118 -0.83029818 2.33439216
C  3.67282432 -1.92803984 2.66682584
H  1.7750266 -0.9228252 2.94220398
H  3.12187201 0.1452337 2.57013304
C  4.96993916 -1.78612675 1.8899937
H  3.85875221 -1.90755202 3.74744793
H  3.21663053 -2.89698259 2.43552812
H  4.77025456 -1.82266139 0.8183836
H  5.45317864 -0.82781237 2.10147329
H  5.67225753 -2.58679796 2.13504676
C  -0.03063525 -2.81850061 2.5290158
C  -0.88380403 -4.03649288 2.83014901
H  -0.36257001 -1.96210745 3.12814594
H  1.00696887 -3.03419798 2.80865883
C  -0.45046136 -5.25723192 2.03920051
H  -0.82543785 -4.22632228 3.90869926
H  -1.9292515 -3.80844382 2.59885199
H  -0.56974511 -5.06967017 0.9717907
H  0.60186905 -5.49477812 2.2207677
H  -1.05120538 -6.13267926 2.29729152
O  0.18959507 4.13855177 0.0406342
F  0.0127884 0.26589618 0.00668281
converged: yes
empdispcorrection: -0.159351649 hartree
orbitalenergy: -3.9841 -3.8985 -3.7071 -3.5086 -3.4326 1.6456 1.7030 1.7438 1.8007 1.8234 electronvolt
orbitalenergy: -4.9987 -4.9785 -4.8776 -4.7948 -4.7411 1.7057 2.1104 2.1505 2.1848 2.2573 electronvolt
s2: 8.81388176
charge: -1.000000
dipole: -20.508433 20.500983 -0.007450 -85.217238 84.881999 -0.335239 4.390862 -4.434133 -0.043271
quadrupole: 11937.563578 -12255.162160 -317.598582 10997.343181 -11316.346078 -319.002898 7487.373910 -7764.781393 -277.407483 -173.580691 173.259895 -0.320796 -548.291271 552.594071 4.302800 -92.281510 91.546356 -0.735153
