program: TURBOMOLE
programVersion: 7.3
title: Local memory allocated for RDGRAD: 16 MiB
elementType: v
basis: def2-TZVP
elementType: o
elementType: c
elementType: h
method: uhf
method: dft
functional: pbe0
elementType: v o c h
basis: def2-TZVP def2-TZVP def2-TZVP def2-TZVP
correction: disp3
energy: -7420.405760571 hartree
formula: C36H86O17V5
InChI: InChI=1S/2C3H8O.10C3H7O.5O.5V/c12*1-2-3-4;;;;;;;;;;/h2*4H,2-3H2,1H3;10*2-3H2,1H3;;;;;;;;;;/q;;;;;;;;;;2*-1;;;;;;;;;2*+1
144 atoms
V  -3.05921435 -0.66243487 0.08838417
V  -1.91245093 2.15755922 -0.56454841
V  2.32792372 -1.98524248 0.06198913
V  1.18804633 2.49980785 -0.45238453
V  -0.72744634 -2.68518763 0.22482477
O  -4.57988992 -0.94341832 0.347892
O  -2.81385362 3.37079437 -0.98976529
O  3.15233903 -3.27993114 0.37905484
O  1.81156446 3.90430875 -0.77922266
O  -0.88045928 -4.22358143 0.47242722
O  -2.0205869 -1.73231269 1.40427687
O  -2.42586625 1.00685691 0.93218841
O  2.57530807 1.41620311 -1.56840266
O  -2.87689057 0.61887469 -1.41029833
O  -0.47623611 3.01569557 0.50537759
O  0.7576706 -2.4005099 -1.06423759
O  -0.27111907 1.79326356 -1.58514721
O  0.75534107 -1.89599372 1.25849344
O  1.88985586 1.61538623 1.08279162
O  -2.14451217 -2.03517484 -0.99693792
C  -2.53938284 -2.43839726 -2.2944817
C  -3.97099885 -2.93268325 -2.32307593
H  -1.88249137 -3.24813842 -2.62074282
H  -2.40234675 -1.5991473 -2.98548791
C  -4.17511825 -4.17229536 -1.47145301
H  -4.63999876 -2.13552497 -1.98261007
H  -4.22713188 -3.13582505 -3.36907026
H  -5.21430843 -4.50503553 -1.50044414
H  -3.54345493 -4.99584907 -1.81569782
H  -3.91552029 -3.97110634 -0.43201275
C  -0.2345777 1.19393252 -2.87176986
C  -0.59349262 2.19348163 -3.95193671
H  -0.9398865 0.35832116 -2.86923597
H  0.76985887 0.79238924 -3.03112413
C  0.4243028 3.30905629 -4.10941362
H  -0.70894825 1.64518278 -4.89346894
H  -1.57371091 2.62114623 -3.71490472
H  0.10933856 4.02485375 -4.87116908
H  0.55867162 3.85715651 -3.17449886
H  1.39805304 2.91115173 -4.40782874
C  -3.79441385 0.78999553 -2.47785285
C  -5.13141539 1.34332479 -2.03253674
H  -3.94469837 -0.17598727 -2.97274555
H  -3.34108239 1.46126132 -3.21569834
C  -6.08398718 1.49054589 -3.20685217
H  -5.55292115 0.67238286 -1.27884686
H  -4.96387663 2.31012172 -1.55176805
H  -5.68378675 2.17385531 -3.96138735
H  -6.26868699 0.5284105 -3.69395546
H  -7.04836356 1.88587052 -2.88285475
C  3.51177601 2.04606666 -2.44412628
C  4.90592465 2.09677684 -1.85638996
H  3.14019097 3.05396717 -2.62994604
H  3.51345156 1.50239902 -3.39581193
C  4.98797925 2.916836 -0.58083891
H  5.25135138 1.0735565 -1.67599487
H  5.56998531 2.51357845 -2.62187923
H  5.99867633 2.90027638 -0.16721933
H  4.70711495 3.95612207 -0.76408092
H  4.30250049 2.52958103 0.17456722
C  0.73299623 -2.63534215 -2.45706368
C  0.63413312 -4.1125225 -2.78564458
H  1.63527932 -2.20309855 -2.89369405
H  -0.11088703 -2.08759715 -2.88402052
C  1.85443516 -4.91457082 -2.36822131
H  -0.25046836 -4.52376839 -2.28680944
H  0.46254411 -4.20611362 -3.86437056
H  1.72200269 -5.97374301 -2.59785339
H  2.75249142 -4.57181285 -2.89020649
H  2.03731452 -4.82268403 -1.29700427
C  -2.57151158 -2.26305757 2.59933663
C  -3.54775396 -3.39495038 2.36544918
H  -3.06965881 -1.45042919 3.14132917
H  -1.75084544 -2.61724056 3.23296533
C  -4.08416563 -3.93453255 3.68047369
H  -4.36660356 -3.0281065 1.74085763
H  -3.03480057 -4.18475329 1.80979748
H  -4.60967318 -3.15887116 4.24504613
H  -4.78681195 -4.75235058 3.51136484
H  -3.27744054 -4.31748569 4.31230518
C  -2.28749388 1.20690419 2.32609943
C  -3.6423174 1.39695894 2.97604844
H  -1.65608275 2.08366983 2.48705075
H  -1.76256728 0.34499311 2.746787
C  -4.37539866 2.62372726 2.46162553
H  -4.24799138 0.50321321 2.78983375
H  -3.49345193 1.46136373 4.05950908
H  -5.36095212 2.71717411 2.92141872
H  -3.81760756 3.53919082 2.67951298
H  -4.51492502 2.56943536 1.38018945
C  -0.68891424 4.20769362 1.24211244
C  -0.73894601 5.45537479 0.38611349
H  0.10700517 4.30394006 1.98989246
H  -1.63413752 4.10794763 1.79085269
C  -0.99041766 6.68665398 1.24040543
H  0.20519643 5.54900821 -0.15451756
H  -1.5314982 5.33579538 -0.35620671
H  -0.20171532 6.82361854 1.98644683
H  -1.02390851 7.58931859 0.62769451
H  -1.94295105 6.61469893 1.77369782
C  1.66952918 2.00645768 2.41839054
C  2.52001867 3.19989039 2.80549767
H  1.91103306 1.15625562 3.07064544
H  0.6082057 2.22757357 2.57286144
C  2.22970651 3.67114724 4.21918002
H  3.57619779 2.93034823 2.70088757
H  2.34171029 4.00531183 2.08476953
H  2.85437732 4.52378686 4.49136808
H  1.18507295 3.97828741 4.32574426
H  2.41457169 2.87756099 4.94883238
C  0.8036116 -1.79623744 2.66683165
C  0.99752842 -3.14656886 3.32174704
H  -0.12118178 -1.32121547 3.00853378
H  1.62659051 -1.12937784 2.93530849
C  1.00225589 -3.03963968 4.83627055
H  0.20687557 -3.82467725 2.98376543
H  1.93711477 -3.57459375 2.9578836
H  1.80117952 -2.37951549 5.18645024
H  0.05566662 -2.63651077 5.20902263
H  1.15235124 -4.01534205 5.30158757
O  3.18919524 -1.01132061 -1.37344775
O  3.11070793 -0.51459997 1.24711425
C  4.50696625 -0.23241194 1.33212527
C  5.23356079 -1.32005185 2.08562491
H  4.61296339 0.72748853 1.84920656
H  4.90845413 -0.12111067 0.32241014
C  4.75395167 -1.48184424 3.51711263
H  5.11707386 -2.26277186 1.54394458
H  6.29996441 -1.07154381 2.0650756
H  5.33190768 -2.24370704 4.04349852
H  4.84451101 -0.54507699 4.07548011
H  3.70661507 -1.78689379 3.54198248
C  4.04160917 -1.54489138 -2.35326789
C  5.39519925 -1.96988522 -1.81503545
H  4.18205724 -0.79575078 -3.14630661
H  3.5812854 -2.41811955 -2.83602126
C  6.25175852 -2.60973085 -2.89383628
H  5.91045765 -1.10023977 -1.39459066
H  5.22977183 -2.67197462 -0.99278982
H  7.22560065 -2.90933839 -2.50216755
H  5.76989411 -3.50362514 -3.29956267
H  6.42681807 -1.92123097 -3.72586903
H  2.82744568 0.42066199 -1.46703461
H  2.59666335 0.38850858 1.12665149
converged: yes
empdispcorrection: -0.185322223 hartree
orbitalenergy: -6.9108 -6.7239 -6.5421 -6.5291 -6.3245 -1.4036 -1.1726 -1.0147 -0.9064 -0.8614 electronvolt
orbitalenergy: -7.9341 -7.8686 -7.7983 -7.7564 -7.5893 -1.0939 -0.8751 -0.7750 -0.7123 -0.5367 electronvolt
s2: 8.81388974
charge: -0.000000
dipole: 7.400169 -6.394512 1.005657 -47.007732 47.452959 0.445227 -19.020560 18.808259 -0.212300
quadrupole: 17802.506268 -18108.646691 -306.140423 14509.335733 -14837.063963 -327.728230 8928.289366 -9216.503199 -288.213833 -298.650708 304.628797 5.978089 25.705592 -26.405017 -0.699425 -294.377424 301.517911 7.140487
