program: TURBOMOLE
programVersion: 7.3
title: Local memory allocated for RDGRAD: 9 MiB
elementType: cl
basis: def2-TZVP
elementType: v
elementType: o
elementType: c
elementType: h
method: uhf
method: dft
functional: pbe0
elementType: cl v o c h
basis: def2-TZVP def2-TZVP def2-TZVP def2-TZVP def2-TZVP
correction: disp3
frequency: -0.00 -0.00 -0.00 0.0000 0.0000 0.0000 100.00 100.00 100.00 100.00 100.00 100.00 100.00 100.00 100.00 100.00 100.00 100.00 100.00 100.00 100.00 100.00 100.00 101.32 103.88 106.03 107.82 110.41 112.36 118.89 123.10 128.70 132.92 134.91 139.04 146.04 152.67 156.86 162.02 166.12 168.92 171.93 174.77 175.54 177.54 180.42 181.70 184.14 188.70 189.08 191.05 195.82 201.71 208.90 212.00 214.73 218.31 219.71 222.61 232.67 241.96 244.10 252.88 254.66 257.76 259.64 264.13 266.41 270.89 274.52 282.01 283.99 292.21 295.20 306.94 312.61 319.79 331.58 333.21 338.52 348.74 364.13 368.11 380.09 409.58 412.43 414.81 418.86 424.11 426.42 431.08 438.13 445.12 448.87 454.40 455.71 464.26 469.24 470.95 477.50 486.47 494.22 511.17 516.98 536.33 550.16 559.00 567.92 807.04 814.14 814.79 815.69 816.88 818.36 819.98 820.12 822.16 823.32 911.46 914.34 914.96 915.56 917.17 919.05 920.17 924.88 931.13 932.08 1066.98 1067.87 1068.91 1069.11 1075.26 1096.56 1096.81 1098.62 1100.83 1102.18 1102.65 1103.38 1104.12 1106.09 1111.98 1137.38 1138.54 1142.57 1144.25 1147.20 1148.98 1157.99 1162.13 1164.60 1175.35 1183.76 1184.51 1184.64 1184.99 1185.45 1185.94 1186.67 1187.66 1190.32 1190.90 1300.80 1307.70 1313.18 1316.99 1317.39 1318.30 1318.76 1320.82 1325.64 1327.11 1376.75 1377.35 1377.89 1378.07 1378.85 1379.31 1380.47 1380.83 1381.88 1383.64 1403.23 1403.83 1405.17 1407.05 1407.84 1408.14 1409.21 1410.81 1412.57 1414.83 1463.43 1464.31 1469.79 1469.84 1470.45 1474.23 1474.77 1475.20 1475.72 1476.38 1481.15 1484.42 1485.12 1486.59 1490.13 1490.33 1491.47 1494.38 1494.96 1498.12 1500.25 1504.98 1505.40 1505.72 1506.66 1508.82 1510.46 1511.34 1514.00 1522.44 2989.60 2994.44 2996.31 2998.07 2998.84 3003.10 3007.83 3010.05 3014.91 3022.14 3026.66 3030.01 3030.85 3031.15 3036.92 3040.11 3042.05 3042.67 3042.70 3042.90 3043.03 3043.45 3043.83 3044.18 3045.45 3048.74 3049.08 3052.86 3059.23 3078.78 3119.00 3120.02 3120.49 3121.67 3121.96 3122.26 3122.82 3124.76 3128.60 3130.92 3132.39 3133.40 3143.38 3145.59 3145.98 3146.66 3147.06 3151.87 3158.02 3181.60
irintensity: 0.00000 0.00000 0.00000 0 0 0 0.41421 0.61262 0.36036 1.21793 0.47374 0.48952 0.39476 0.15824 0.18605 0.16610 0.16689 0.22600 0.05029 0.04690 0.01794 0.08290 0.21874 0.17993 0.09672 0.13873 0.26489 0.11796 0.19573 0.03426 0.00850 0.01412 0.18858 0.43672 0.02376 0.08136 1.11051 0.17287 0.34628 0.57904 1.33963 5.50697 1.24995 2.54613 4.00489 1.17407 1.58753 3.15888 1.01920 0.21831 0.55684 0.29437 0.31449 1.27652 3.88078 0.22564 2.80971 2.10358 4.47160 1.19157 0.38727 0.60124 0.65193 0.00357 0.20746 0.05155 0.26223 0.05217 0.20908 0.38462 0.37979 1.18633 9.92460 3.38103 26.83778 65.10289 22.70608 0.13740 20.62288 2.21430 12.55970 3.91635 1.35588 3.55448 2.40788 8.08981 4.25546 3.45562 8.60939 0.97981 0.53096 13.31036 13.40779 20.60811 14.17348 4.70146 36.51886 6.64442 4.70957 7.62945 92.85213 120.66868 126.56886 390.20775 261.79405 289.42514 79.75660 119.56710 1.92684 0.34003 0.08162 0.21380 0.38492 0.07724 0.41467 0.52512 1.00065 0.76296 12.70376 12.11973 32.93276 0.22650 6.24702 41.10058 15.01908 2.34803 2.65234 34.10864 154.90172 179.11290 162.15102 154.33325 11.30918 107.34035 5.56176 100.58960 84.05781 76.25981 183.56544 34.26459 200.38260 162.87530 5.32628 38.34948 57.89921 34.50562 38.99951 319.43963 60.46176 382.91226 167.55744 476.42829 7.11642 3.46503 7.41027 1.93820 6.14045 13.89982 26.86218 10.33053 2.88532 0.63892 1.78992 0.52935 0.44565 2.51919 0.02581 0.22773 0.45959 0.08819 0.43163 0.51219 0.15084 2.87064 1.29692 1.15452 1.15029 5.16012 0.30194 3.47169 0.60564 2.78831 3.19342 11.56196 15.94609 29.75788 31.19618 33.60265 24.58604 64.59540 57.16606 89.04033 4.55004 3.26890 2.43949 1.41416 6.89985 6.96921 2.12208 8.48401 8.16916 0.66097 2.41865 1.01148 0.81389 1.04585 0.20040 0.37362 0.18023 0.82103 2.51696 0.44185 0.54185 3.73384 1.93000 1.27962 0.02931 2.18587 0.67327 2.24870 2.28253 8.55734 1.05722 82.55096 68.07178 69.57140 16.34561 93.88252 34.28683 24.89428 88.08558 45.29391 34.70247 35.88248 25.54469 37.31898 27.89569 32.64887 28.48605 34.95431 28.63064 85.90046 71.00377 22.05739 30.27711 52.60401 39.26045 54.16527 3.85952 54.52410 57.71182 39.32692 8.76245 32.31898 13.52686 45.88696 22.60777 33.22119 10.19407 26.91091 23.28793 25.91826 17.19462 33.92975 19.89472 11.56934 6.82842 6.39845 6.72948 5.90992 5.10065 5.93950 3.52930
energy: -7099.310450511 hartree
formula: C20H50ClO15V5
InChI: InChI=1S/10C2H5O.Cl.5O.5V/c10*1-2-3;;;;;;;;;;;/h10*2H2,1H3;;;;;;;;;;;
91 atoms
Cl -0.04580287 -0.0271674 -0.32172796
V  -1.18787245 -2.33575772 0.23067556
V  1.86324392 -1.88019954 -0.07122387
V  -0.41454204 2.57375663 -0.03170892
V  2.32558469 1.17521329 -0.2988135
V  -2.59862286 0.41600466 0.32832366
O  -1.87806083 -3.73677527 0.41896278
O  2.98368882 -2.98651705 -0.05261606
O  -0.68656739 4.12397479 -0.02965145
O  3.72696963 1.86780109 -0.48222238
O  -4.12630885 0.70151977 0.5791768
O  -2.53663207 -1.24283294 -0.82884763
O  0.32361919 -2.71400578 -1.07460035
O  1.27397969 2.2646274 1.03656398
O  0.50548558 -2.37466847 1.32447149
O  2.43679569 -0.50031082 -1.46062411
O  -1.61851229 1.80635298 1.36329859
O  2.59190384 -0.34108861 0.96690553
O  -1.99138039 1.78758972 -1.05716929
O  1.07047398 2.32851828 -1.38337498
O  -2.07849219 -1.09479838 1.54188208
C  -2.77246276 -1.20332585 -2.20895546
H  -2.1502798 -0.42653539 -2.67311261
H  -2.47817841 -2.16120481 -2.65175759
C  0.299136 -2.81453261 -2.4712569
C  1.83279292 3.27565881 1.84462736
H  1.05891818 3.61874223 2.54405569
H  -0.70582118 -3.1104857 -2.7917768
H  0.50770895 -1.83410313 -2.92061949
H  2.63555496 2.8308352 2.44821985
C  0.70794658 -3.26157936 2.39783142
H  1.57853095 -2.92103166 2.97243393
H  -0.16004311 -3.19474136 3.06621755
C  3.41026441 -0.67310258 -2.46093116
C  -1.5816109 1.94487624 2.75891758
H  3.41603672 0.22597709 -3.09174016
H  -1.39256527 3.00197328 2.99105338
H  3.10373916 -1.50980915 -3.10291006
H  -2.58308711 1.71233308 3.14555746
C  2.65165198 -0.29188943 2.36729842
C  -2.80993006 2.55089105 -1.90800981
H  -2.16101848 3.12289567 -2.58494412
H  1.71488539 -0.67313989 2.7870284
H  -3.39545573 1.86478403 -2.53458748
C  1.00884868 2.4631503 -2.77628534
C  -2.82893105 -1.51766156 2.65404363
H  2.03319472 2.59927882 -3.15030929
H  -3.01549 -0.64695789 3.29614246
H  0.46125925 3.38803423 -3.00513238
H  -2.21647175 -2.21818167 3.23658708
H  2.7407087 0.7516616 2.68539914
C  4.79779708 -0.92278732 -1.90865153
H  5.11057035 -0.07595474 -1.29537736
H  4.79960078 -1.82307238 -1.29149584
H  5.51265642 -1.05107219 -2.72747847
C  0.35478756 1.28843172 -3.47449854
H  -0.66718416 1.1604947 -3.11712609
H  0.34103302 1.4512174 -4.55645824
H  0.89966149 0.36973226 -3.25562816
C  -3.73386699 3.49198261 -1.16440655
H  -3.14748853 4.19117027 -0.5658518
H  -4.34602202 4.05829718 -1.87333366
H  -4.3902843 2.9265205 -0.50065629
C  -4.24066843 -0.95604679 -2.48831045
H  -4.84304925 -1.77172903 -2.08253099
H  -4.57316999 -0.03177103 -2.01074781
H  -4.42187366 -0.88279694 -3.56471926
C  1.2977066 -3.84923252 -2.94792606
H  2.30298109 -3.60533761 -2.59788387
H  1.0393418 -4.83228152 -2.54834841
H  1.30639235 -3.90151617 -4.04065289
C  -0.5455718 1.06897608 3.43181112
H  0.4562283 1.36523598 3.12944605
H  -0.63161702 1.15278162 4.51962512
H  -0.68406974 0.02884645 3.13718358
C  -4.14035604 -2.16859116 2.26943593
H  -4.68514326 -2.47671735 3.16720384
H  -4.75468109 -1.46354596 1.70662073
H  -3.95336573 -3.0464694 1.64876575
C  0.91249604 -4.69293493 1.94926365
H  1.07046391 -5.34122139 2.8166707
H  0.03568749 -5.04111805 1.40064757
H  1.78400572 -4.7568742 1.29496754
C  3.83757984 -1.090732 2.86495738
H  3.77558035 -2.1223715 2.5100345
H  4.76768116 -0.6635522 2.48366344
H  3.87130109 -1.09369759 3.95842577
C  2.37946809 4.45166373 1.06309804
H  1.58382377 4.92151653 0.48323922
H  2.79874198 5.19079256 1.75285442
H  3.16396035 4.1183953 0.3820439
converged: yes
empdispcorrection: -0.126600524 hartree
orbitalenergy: -4.0943 -4.0733 -3.6698 -3.6044 -3.5759 1.5674 1.5912 1.6525 1.6596 1.7251 electronvolt
orbitalenergy: -4.9605 -4.9088 -4.7380 -4.6611 -4.5851 1.7508 2.0584 2.1157 2.1507 2.1673 electronvolt
s2: 8.81871003
charge: -1.000000
dipole: 12.193661 -12.208882 -0.015221 -54.019432 54.080098 0.060666 5.340191 -5.375754 -0.035564
quadrupole: 8278.663139 -8551.391451 -272.728311 7763.102731 -8034.723169 -271.620438 4377.089860 -4604.344075 -227.254215 -280.795884 282.036733 1.240849 -234.162708 238.678960 4.516252 -242.469472 244.386192 1.916720
