program: TURBOMOLE
programVersion: 7.3
title: Local memory allocated for RDGRAD: 11 MiB
elementType: v
basis: def2-TZVP
elementType: o
elementType: c
elementType: h
method: uhf
method: dft
functional: pbe0
elementType: v o c h
basis: def2-TZVP def2-TZVP def2-TZVP def2-TZVP
correction: disp3
frequency: -0.00 -0.00 -0.00 0.0000 0.0000 0.0000 100.00 100.00 100.00 100.00 100.00 100.00 100.00 100.00 100.00 100.00 100.00 100.00 100.00 100.00 100.00 100.00 100.00 100.00 100.00 100.00 100.00 100.00 100.00 100.19 101.92 102.31 103.57 105.39 106.85 111.20 113.19 117.76 125.05 128.80 132.61 136.64 140.18 141.59 144.98 147.72 149.86 154.35 164.35 171.19 183.52 187.13 190.51 190.77 194.57 199.10 203.59 205.55 213.11 214.96 216.86 219.32 220.24 224.83 225.92 230.97 231.63 233.26 236.17 240.49 244.97 249.45 252.22 260.56 261.46 264.96 265.45 266.03 271.00 287.19 293.77 295.76 297.00 301.77 302.87 313.16 315.09 329.85 342.04 345.58 352.22 373.22 378.99 388.09 392.64 395.13 400.88 402.54 412.27 430.01 435.79 443.72 452.31 454.30 455.56 469.00 474.06 475.86 476.89 477.68 481.04 483.00 486.51 486.85 490.66 493.81 503.64 518.57 518.82 533.68 544.41 587.21 593.27 597.96 607.01 607.74 804.95 810.06 817.73 817.93 818.40 819.44 822.18 824.67 824.84 824.96 825.28 825.67 913.27 914.33 914.68 916.04 916.74 918.12 927.97 930.45 930.95 932.17 933.08 934.61 1077.45 1078.44 1079.25 1082.64 1083.94 1090.08 1091.11 1096.26 1096.38 1096.95 1097.53 1100.05 1106.61 1106.90 1108.41 1112.65 1113.24 1118.91 1120.72 1120.81 1122.16 1123.27 1123.41 1123.81 1130.67 1131.12 1139.30 1146.83 1147.63 1166.01 1182.03 1184.40 1184.68 1185.55 1185.79 1185.93 1186.14 1186.26 1191.31 1192.24 1192.55 1193.34 1296.63 1303.22 1305.54 1308.51 1308.80 1320.71 1330.24 1330.77 1332.85 1333.06 1333.25 1334.24 1374.22 1377.10 1378.46 1380.07 1381.68 1382.99 1387.35 1388.19 1388.28 1388.41 1388.60 1388.92 1408.41 1408.50 1410.07 1410.76 1411.71 1412.10 1415.19 1415.85 1416.47 1416.75 1417.36 1418.09 1466.54 1472.26 1472.70 1473.03 1473.33 1473.54 1477.36 1477.57 1477.95 1478.32 1478.87 1479.45 1486.49 1488.32 1489.27 1489.67 1490.67 1491.36 1493.87 1495.04 1495.73 1495.98 1498.11 1500.02 1506.73 1509.18 1510.28 1510.47 1511.32 1513.26 1518.18 1518.76 1518.91 1522.70 1526.02 1530.49 3020.83 3021.32 3023.39 3024.52 3025.08 3028.97 3033.76 3046.02 3046.18 3046.59 3046.95 3047.10 3059.05 3059.06 3059.10 3059.14 3059.19 3059.32 3059.78 3060.12 3062.33 3062.49 3063.15 3066.74 3068.71 3071.41 3072.88 3075.41 3078.41 3081.07 3085.39 3109.03 3110.80 3111.39 3112.33 3112.54 3130.72 3130.74 3131.22 3131.55 3131.76 3133.72 3135.12 3135.38 3135.95 3136.37 3136.67 3136.90 3136.91 3136.94 3136.99 3137.05 3158.71 3159.54 3159.57 3159.60 3159.84 3160.01 3160.04 3184.48
energy: -7966.988655270 hartree
formula: C24H60O18V6
InChI: InChI=1S/12C2H5O.6O.6V/c12*1-2-3;;;;;;;;;;;;/h12*2H2,1H3;;;;;;;;;;;;
108 atoms
V  -1.70998676 -2.63835739 -0.25291146
V  1.7006677 2.63260212 0.15625037
V  -3.09056202 0.15468503 -0.01585863
V  3.08586295 -0.17961002 -0.01233729
V  -1.40791942 2.79903655 0.15314312
V  1.41271485 -2.80821809 -0.25068533
O  -2.56469416 -3.94632683 -0.37816711
O  -4.65325894 0.27401027 -0.01187913
O  4.65227138 -0.23019621 -0.00640429
O  -2.1731523 4.16504043 0.16832952
O  2.12014291 -4.20178067 -0.37223711
O  -0.17310024 -3.15732679 0.90841119
O  0.16821392 3.10355114 -1.02684551
O  -2.31940815 -1.30308464 1.05646702
O  2.24502138 1.21865074 -1.10136694
O  -2.7047293 -1.29309016 -1.33256746
O  2.64794905 1.27901878 1.28237566
O  -2.49872782 1.55770013 1.27899062
O  2.54826521 -1.57794476 -1.32934402
O  -2.1013673 1.45274004 -1.10438079
O  2.16026438 -1.54559884 1.0587146
O  0.14571478 2.72345106 1.36174977
O  -0.13474502 -2.48254942 -1.41908442
C  -0.22939545 -4.20363074 1.87065301
H  0.65833463 -4.12810815 2.50871902
H  -1.1019768 -4.03143683 2.51089282
C  -2.27063294 -1.4359875 2.46294172
C  2.13226534 1.25274241 -2.51122711
H  -1.30925856 -1.88133416 2.73236701
H  -2.29633617 -0.43896206 2.90471384
H  2.01820824 0.22774041 -2.8691576
C  -3.56308014 -1.6350271 -2.41361808
C  3.48633671 1.59475305 2.38601579
H  -3.78913519 -0.71928268 -2.97231591
H  3.75520783 0.65888486 2.88952963
H  -3.01118109 -2.29938173 -3.08921157
H  2.90451772 2.18662397 3.10153685
C  -3.29982834 1.96210279 2.38131531
C  3.36726897 -2.00640581 -2.4099706
H  -2.65861463 2.48770671 3.09787314
H  2.74811138 -2.60240628 -3.09089525
H  -3.66912387 1.06076156 2.88424467
H  3.69459702 -1.11803602 -2.96279727
C  -1.98762189 1.47370183 -2.51436381
C  2.09758825 -1.67179293 2.46524827
H  -1.97756816 0.44190225 -2.87098495
H  2.2273399 -0.68256685 2.90627259
H  -1.021245 1.91163921 -2.7715846
H  1.09498474 -2.01386507 2.73476651
C  0.14996532 2.83510689 2.77295323
C  -0.11759627 -2.20662904 -2.80660318
H  1.05691253 3.37397653 3.06779103
H  0.78998513 -1.64246293 -3.03126679
H  -0.69462645 3.46832528 3.06543274
H  -0.96503074 -1.55728567 -3.03617124
O  2.60875952 3.90833635 0.17650914
C  0.22233634 4.12633215 -2.01470211
H  -0.66765507 4.03391021 -2.64801733
H  1.09522932 3.93814228 -2.65061208
H  1.21438079 1.78577141 -2.76648873
C  -3.4277336 -2.27107532 2.95646569
H  -3.41120682 -3.2614793 2.49480891
H  -3.38110699 -2.38988253 4.04161335
H  -4.37675514 -1.7961729 2.69709532
C  -4.46850035 2.8335335 1.98506452
H  -5.1196563 2.30115658 1.29081371
H  -5.04622502 3.09249008 2.87619637
H  -4.12335027 3.7532693 1.51232371
C  0.07653366 1.49137995 3.45241424
H  0.07940136 1.61123524 4.53854876
H  -0.83186972 0.97065948 3.15555701
H  0.92638223 0.87720256 3.16107953
C  4.74280663 2.33488012 1.991659
H  5.3439412 2.52968609 2.88364923
H  5.33349119 1.7354393 1.29805079
H  4.49959163 3.28662787 1.51895742
C  3.16100775 -2.62291302 2.95945786
H  3.10220056 -2.73545079 4.04467547
H  3.04104109 -3.60647406 2.49843426
H  4.15446654 -2.25001639 2.69979399
C  -0.30552968 -5.58024148 1.25342201
H  -1.2007784 -5.67462924 0.63818786
H  0.5728491 -5.77168252 0.63643105
H  -0.3457917 -6.33145331 2.04653423
C  4.56741721 -2.80871542 -1.96563387
H  5.15180133 -3.10380036 -2.84101509
H  5.20135786 -2.21347113 -1.30774755
H  4.25086982 -3.70908568 -1.43821692
C  -0.17765755 -3.4883941 -3.6016465
H  -0.16386952 -3.2774186 -4.67366489
H  0.67472946 -4.12819789 -3.36064897
H  -1.08981398 -4.04193682 -3.36630206
C  -4.84522408 -2.29868881 -1.96954897
H  -5.45538024 -2.53328987 -2.8456595
H  -4.63060043 -3.2252219 -1.4362092
H  -5.41266069 -1.63413504 -1.31733015
C  -3.12494578 2.25563404 -3.12615809
H  -3.03784611 2.27388124 -4.21517017
H  -4.08494843 1.80655466 -2.8598288
H  -3.12334131 3.2842926 -2.75752232
C  0.29846943 5.51755686 -1.43156221
H  1.19515191 5.62749466 -0.82090358
H  0.33712013 6.24922511 -2.24276914
H  -0.57978591 5.72354128 -0.81898448
C  3.34149378 1.91732265 -3.12368225
H  3.44449003 2.93999902 -2.75265539
H  4.25179321 1.37298672 -2.86066622
H  3.25441722 1.94723222 -4.21243565
converged: yes
empdispcorrection: -0.145556802 hartree
orbitalenergy: -6.8526 -6.8457 -6.7523 -6.7005 -6.6689 -1.2504 -1.2401 -1.2269 -1.2099 -1.1984 electronvolt
orbitalenergy: -8.1381 -8.1193 -8.1147 -8.0833 -8.0627 -1.3285 -1.0676 -1.0583 -0.7191 -0.7090 electronvolt
s2: 12.07719420
charge: 0.000000
dipole: -3.730588 3.727410 -0.003178 -47.256996 47.234140 -0.022855 -37.034859 37.139922 0.105063
quadrupole: 11826.185730 -12110.230173 -284.044443 11883.395095 -12166.563214 -283.168120 5459.176096 -5691.523145 -232.347048 3.761206 -3.735091 0.026114 18.311263 -18.545578 -0.234315 253.704416 -257.139178 -3.434762
