program: TURBOMOLE
programVersion: 7.3
title: Local memory allocated for RDGRAD: 9 MiB
elementType: v
basis: def2-TZVP
elementType: o
elementType: c
elementType: h
method: uhf
method: dft
functional: pbe0
elementType: v o c h
basis: def2-TZVP def2-TZVP def2-TZVP def2-TZVP
correction: disp3
frequency: -0.00 0.0000 0.0000 0.0000 0.0000 0.0000 100.00 100.00 100.00 100.00 100.00 100.00 100.00 100.00 100.00 100.00 100.00 100.00 100.00 100.00 100.00 100.00 100.00 100.00 100.00 100.00 100.00 101.11 104.97 112.16 116.70 121.82 122.76 123.93 129.16 129.97 138.80 143.39 151.39 161.57 167.33 170.09 171.83 172.56 178.16 180.62 184.22 187.88 205.59 207.46 207.52 215.37 217.41 218.73 219.06 225.48 227.83 240.10 242.31 251.58 261.77 265.27 268.97 270.55 275.35 278.51 281.27 286.02 290.36 291.77 296.53 318.82 320.45 342.98 345.31 363.89 366.72 377.44 377.98 389.51 392.72 411.15 421.51 422.38 440.66 443.54 451.21 455.97 462.03 466.46 474.87 476.60 486.94 487.76 490.88 492.34 500.48 509.03 524.57 534.66 543.68 589.13 601.07 606.92 609.40 811.19 811.62 816.14 817.92 818.53 819.19 821.83 822.42 826.93 829.21 916.96 917.26 919.44 921.20 925.01 928.85 932.89 933.36 935.95 936.81 1079.47 1081.94 1084.76 1086.78 1087.47 1090.67 1096.30 1096.48 1098.06 1099.42 1105.17 1107.31 1111.48 1112.60 1117.44 1119.27 1122.29 1123.03 1123.72 1126.88 1127.14 1135.94 1142.97 1144.67 1167.99 1183.05 1183.92 1184.83 1185.28 1186.16 1186.19 1186.42 1186.64 1194.29 1195.58 1302.75 1304.13 1310.75 1311.47 1312.19 1313.99 1324.01 1325.64 1328.46 1329.95 1376.06 1377.70 1380.56 1382.15 1382.32 1383.93 1384.72 1385.66 1385.93 1386.14 1408.46 1408.81 1410.70 1411.48 1411.94 1412.92 1414.48 1414.92 1415.68 1416.48 1472.65 1473.51 1473.67 1474.17 1475.87 1477.05 1477.76 1478.67 1478.92 1479.28 1485.10 1487.49 1489.31 1489.84 1491.03 1491.39 1493.19 1493.28 1494.50 1498.71 1503.95 1506.21 1506.73 1506.90 1513.85 1515.16 1515.72 1517.60 1528.77 1530.71 3012.66 3012.98 3028.22 3029.18 3038.57 3039.23 3047.41 3047.47 3048.06 3048.43 3051.52 3051.67 3051.86 3052.31 3053.81 3054.04 3056.20 3056.43 3066.17 3066.19 3067.74 3067.87 3074.54 3074.88 3078.78 3080.16 3107.39 3107.68 3111.51 3112.37 3130.17 3130.26 3131.20 3131.39 3132.21 3133.12 3133.20 3133.39 3134.20 3134.37 3135.45 3135.53 3137.63 3138.01 3142.40 3142.66 3147.31 3148.08 3152.88 3153.32
irintensity: 0.00000 0 0 0 0 0 0.03878 0.00651 0.52191 0.28341 1.93076 0.85196 0.72477 0.29414 0.45129 0.62104 0.05268 0.00592 0.10037 0.02926 0.01363 0.58382 0.19697 0.00194 0.16828 0.18126 0.05845 0.01022 0.48132 0.19896 0.22523 0.23995 0.56824 0.12397 0.69602 0.56483 0.13814 5.14123 0.49790 0.19979 0.31829 0.89156 0.34890 2.41016 0.80498 2.59106 0.06674 1.23514 0.22663 0.12073 0.18677 0.22426 1.42650 1.93290 1.07884 0.12365 0.26117 0.13592 0.04090 0.02007 0.00199 0.03320 0.03730 0.01426 0.09056 0.28576 0.06170 0.08092 0.09106 0.01984 0.13950 38.70181 39.01557 0.10167 2.92548 1.95369 0.05656 0.13231 2.12518 0.27928 1.59974 2.57404 0.71693 2.72914 20.79067 6.46058 4.02472 3.12127 10.95693 6.81996 0.88860 2.96050 1.80583 6.97187 0.89346 7.51952 37.54687 36.25322 28.60096 31.01406 177.22899 610.97785 406.22189 322.57588 73.72102 0.38859 0.44395 0.15262 0.12107 0.35064 0.14591 0.05610 0.04531 0.47436 0.52323 15.58099 13.90095 17.25072 1.74399 94.32973 7.06453 2.67747 0.88543 2.56011 56.70283 0.96661 10.80426 19.19133 0.78907 15.04304 107.54576 28.44192 157.04596 116.93609 253.18801 0.31562 167.04548 256.12455 273.87058 0.56056 11.85687 16.89763 15.67044 3.14864 22.78175 140.45978 563.44036 313.20157 225.90272 5.00293 3.92879 9.28973 11.56540 8.04305 5.55977 6.39437 1.65991 10.32972 7.08320 6.44700 0.52906 0.49157 0.52885 0.84460 0.36470 0.58632 0.35866 0.24991 0.29678 0.32663 3.11236 2.54632 1.88390 21.82459 0.92156 0.35240 0.29139 1.32245 0.46262 0.87801 22.87456 8.92966 8.01552 62.73839 2.97647 5.71493 78.68763 12.08804 96.95727 8.94690 3.63512 1.67414 9.86156 11.52941 1.10057 6.60599 10.13326 17.30903 0.06178 3.13215 0.57653 1.00722 0.80964 1.82118 0.21802 0.53880 4.06607 1.32861 3.88228 0.02438 1.26896 0.60659 0.51055 0.55207 3.02625 1.09488 4.24139 4.97758 2.54945 2.45198 71.44875 22.55871 19.98447 22.02743 115.41011 6.18034 20.31155 9.70989 14.97243 13.67678 21.66496 3.75520 21.60380 25.71936 23.99261 18.73459 21.43703 23.72016 37.72613 56.61810 5.47886 4.04600 17.80589 41.36601 8.45906 9.45411 0.51667 0.49896 0.16966 0.25499 5.67617 15.04089 36.99502 29.78827 35.01058 1.53752 36.00706 2.19828 20.86348 14.14221 7.89540 12.51398 32.88551 32.95472 4.74501 13.17045 6.99966 6.97407 5.55376 5.50624
energy: -6639.147488016 hartree
formula: C20H50O15V5
InChI: InChI=1S/10C2H5O.5O.5V/c10*1-2-3;;;;;;;;;;/h10*2H2,1H3;;;;;;;;;;
90 atoms
V  -1.02649455 -2.53306212 0.10879051
V  1.97016904 -1.74618041 -0.02828029
V  -0.69138675 2.4912756 -0.14808531
V  2.17660422 1.36209476 -0.00029712
V  -2.66938033 0.09662765 0.1065157
O  -1.60103247 -3.99118052 0.16756686
O  3.18964167 -2.72930908 -0.10888773
O  -1.09964319 3.98902891 -0.3617459
O  3.50466874 2.18548946 0.11873642
O  -4.22829079 0.22639824 0.21977522
O  -2.32365106 -1.51503559 -1.01155731
O  0.41094036 -2.12981036 -1.16815758
O  0.79993352 2.25623558 1.12468868
O  0.64671187 -2.59969277 1.19040188
O  2.4634231 -0.2000314 -1.1846368
O  -1.93334423 1.63451973 1.13605793
O  2.09806422 -0.21570147 1.1862266
O  -1.75066908 1.20982236 -1.21655267
O  0.89134031 2.11822407 -1.29306537
O  -1.76945893 -1.17241568 1.31505486
C  -3.27404904 -2.12320932 -1.87234595
H  -3.68757727 -1.34750035 -2.52852355
H  -2.74505192 -2.8432096 -2.50871658
C  0.3274695 -1.96214904 -2.57106991
C  1.07556886 3.06480885 2.25538724
H  -0.72386861 -1.84147547 -2.83927421
H  0.83925668 -1.03279746 -2.836088
H  0.18594485 3.08215672 2.89402076
C  0.94802634 -3.62881405 2.12018418
H  1.79717011 -3.29983637 2.73176496
H  0.08709962 -3.74512934 2.78984178
C  3.38107291 -0.2695735 -2.26246613
C  -2.61012828 2.28112847 2.19998866
H  3.22620894 0.60332848 -2.90634898
H  -3.03112075 1.51275052 2.85802362
H  3.14391804 -1.15732301 -2.85948473
H  -1.87558065 2.84215836 2.78830544
C  1.99253184 -0.20401891 2.59636085
C  -1.71747797 1.04949548 -2.62105939
H  -0.67330685 1.02209548 -2.94307335
H  1.6413347 -1.18365034 2.92411649
H  -2.15091192 0.07896627 -2.86794369
C  1.20280772 2.78500096 -2.50352809
C  -1.55672319 -1.01244742 2.70500128
H  -0.70445446 -1.63021802 2.99441063
H  1.81394305 2.11741292 -3.12063234
H  0.27147557 2.96570913 -3.04891105
H  -1.28103558 0.02899512 2.89229843
H  1.87701843 2.59190396 2.83168129
H  1.22513792 0.52062455 2.88049863
C  -4.38894288 -2.81100649 -1.12008678
H  -3.98614 -3.60188311 -0.48582815
H  -4.92580983 -2.0912449 -0.50008661
H  -5.09342988 -3.25585677 -1.82749856
C  0.93578332 -3.1502949 -3.27683692
H  1.97892156 -3.2827425 -2.97872527
H  0.39492602 -4.06417876 -3.02198123
H  0.898019 -3.0132139 -4.36024061
C  4.81301547 -0.32487489 -1.78528682
H  5.49177871 -0.37369997 -2.64045885
H  5.05111237 0.56505618 -1.19957964
H  4.96767206 -1.20914269 -1.16487301
C  1.91437449 4.09320967 -2.25267282
H  1.28011803 4.75375166 -1.65799206
H  2.84862521 3.924941 -1.7133421
H  2.1402402 4.58732466 -3.20076996
C  -2.4802059 2.16446817 -3.29613825
H  -2.07067011 3.13873457 -3.01766104
H  -2.42838908 2.06065112 -4.38269198
H  -3.52917233 2.14480643 -2.99354956
C  1.48216527 4.4638567 1.85772496
H  0.68573435 4.94697902 1.28809295
H  1.68996297 5.0630354 2.74756191
H  2.38353392 4.42913846 1.24254108
C  -3.70076902 3.19936478 1.70158885
H  -3.27948663 3.97127971 1.05478397
H  -4.44094189 2.62976424 1.13703245
H  -4.19962308 3.68242459 2.54549986
C  -2.79679902 -1.40435102 3.47216986
H  -3.03942633 -2.45434021 3.29534662
H  -2.64695023 -1.25668681 4.54441701
H  -3.65261082 -0.80356809 3.15411354
C  1.27169364 -4.94458127 1.45249435
H  1.49977257 -5.69808274 2.21069743
H  0.4207696 -5.28962663 0.86356109
H  2.13911979 -4.83341268 0.79999919
C  3.32761613 0.12440841 3.22086764
H  3.24115164 0.16606789 4.30939174
H  4.06726252 -0.63488828 2.9587715
H  3.69673526 1.08834823 2.86193107
converged: yes
empdispcorrection: -0.118282085 hartree
orbitalenergy: -7.0061 -6.9736 -6.6640 -6.6329 -6.5823 -1.2233 -1.2068 -1.1546 -1.1442 -1.0678 electronvolt
orbitalenergy: -8.2424 -8.1546 -8.0470 -7.9830 -7.8656 -1.3679 -0.9318 -0.9173 -0.7194 -0.6615 electronvolt
s2: 8.81277053
charge: 0.000000
dipole: -17.841995 17.957473 0.115478 -4.012026 4.309831 0.297805 3.620963 -3.638441 -0.017478
quadrupole: 7717.503602 -7952.347945 -234.844343 8102.002673 -8333.867728 -231.865055 4279.151170 -4473.363126 -194.211957 188.547153 -187.125844 1.421309 -212.940196 213.015912 0.075716 -82.758217 84.207242 1.449025
