program: TURBOMOLE
programVersion: 7.3
title: Local memory allocated for RDGRAD: 11 MiB
elementType: v
basis: def2-TZVP
elementType: o
elementType: c
elementType: h
method: uhf
method: dft
functional: pbe0
elementType: v o c h
basis: def2-TZVP def2-TZVP def2-TZVP def2-TZVP
correction: disp3
frequency: -0.00 -0.00 0.0000 0.0000 0.0000 0.0000 100.00 100.00 100.00 100.00 100.00 100.00 100.00 100.00 100.00 100.00 100.00 100.00 100.00 100.00 100.00 100.00 100.00 100.00 100.00 100.00 100.00 100.00 100.00 100.00 100.00 100.64 104.11 104.90 106.24 113.64 120.07 121.26 121.48 127.32 133.05 138.26 139.70 140.93 143.35 148.35 155.33 161.75 169.22 169.40 180.14 185.04 187.72 190.86 191.39 194.52 196.27 198.23 210.27 211.68 216.51 217.40 221.96 227.59 228.42 229.53 233.83 235.46 241.28 242.59 253.77 254.00 258.45 262.75 264.82 266.57 267.23 268.66 285.42 288.17 290.69 296.43 302.24 306.94 307.34 323.77 336.94 343.52 354.84 357.12 382.69 382.81 397.68 398.55 405.60 421.84 430.19 438.66 443.96 444.67 451.03 453.83 462.28 470.30 473.12 477.11 477.81 482.06 485.62 491.52 496.71 499.24 514.06 526.88 532.88 539.28 572.78 582.16 594.64 603.65 606.03 810.88 811.19 812.28 817.20 817.91 819.34 819.56 821.98 822.68 823.69 823.75 824.00 911.55 912.56 915.55 916.31 917.20 917.46 919.56 920.28 930.72 930.78 932.63 934.11 1077.54 1077.69 1079.55 1080.39 1084.96 1089.90 1091.69 1093.58 1093.95 1094.97 1096.71 1102.11 1102.78 1105.83 1109.23 1111.63 1116.84 1118.51 1121.25 1121.32 1122.36 1123.18 1123.81 1127.70 1129.05 1132.26 1138.46 1143.76 1156.44 1160.26 1168.40 1180.55 1182.90 1185.61 1185.90 1186.11 1186.23 1188.17 1188.27 1191.78 1191.99 1221.16 1275.31 1302.90 1303.23 1311.62 1311.90 1315.30 1315.67 1320.19 1326.25 1328.93 1328.98 1331.66 1331.79 1377.49 1378.56 1381.20 1381.89 1383.17 1385.61 1385.84 1386.41 1386.82 1388.02 1388.34 1388.52 1408.21 1409.03 1409.96 1410.17 1410.70 1413.18 1413.68 1415.47 1415.56 1416.54 1416.73 1419.80 1472.94 1473.00 1473.09 1473.14 1473.88 1474.14 1475.32 1475.39 1477.42 1477.70 1478.34 1478.85 1484.10 1485.65 1486.97 1488.05 1489.82 1490.00 1491.34 1495.27 1496.38 1497.01 1497.32 1498.66 1505.80 1507.98 1508.30 1510.71 1511.14 1511.50 1511.81 1511.87 1512.67 1513.06 1524.48 1524.56 1542.14 1556.57 2198.86 2314.14 3014.85 3015.46 3022.63 3022.73 3024.69 3024.85 3042.84 3044.20 3044.24 3046.19 3046.23 3046.37 3046.43 3048.00 3052.57 3052.67 3057.72 3057.73 3057.76 3057.89 3059.70 3059.93 3063.09 3063.19 3064.96 3065.01 3067.89 3068.13 3080.94 3081.06 3086.04 3089.42 3108.29 3108.40 3110.58 3110.63 3124.11 3124.14 3126.07 3126.12 3129.82 3129.84 3130.15 3130.16 3130.35 3130.38 3134.63 3134.70 3135.19 3135.26 3135.58 3135.62 3135.72 3135.73 3146.03 3146.21 3157.25 3157.26 3157.55 3157.56
energy: -6949.039459264 hartree
formula: C24H62O17V5
InChI: InChI=1S/2C2H6O.10C2H5O.5O.5V/c12*1-2-3;;;;;;;;;;/h2*3H,2H2,1H3;10*2H2,1H3;;;;;;;;;;/q;;;;;;;;;;2*-1;;;;;;;;;2*+1
108 atoms
V  -0.01156317 2.77827734 0.00093966
V  -2.64498935 1.12800821 0.2489119
V  2.43354911 -1.94460581 -0.0078102
V  -2.41357448 -1.9664329 0.00627876
V  2.63671902 1.15204359 -0.24849131
O  -0.01884923 4.34544289 0.00145794
O  -4.03541102 1.80716432 0.50873843
O  3.70291827 -2.85328895 -0.17802919
O  -3.67500507 -2.88614473 0.17619384
O  4.02095426 1.84361277 -0.50853795
O  1.36087355 2.24104469 -1.33190854
O  -1.09860292 -3.03888739 1.16842559
O  -1.42823028 1.91811263 -1.06943233
O  1.26712486 -2.43884571 1.42664346
O  -1.379135 2.22754386 1.33334101
O  1.12840872 -3.0280079 -1.17085634
O  -3.08411552 -0.37676083 -0.98227641
O  3.0898231 -0.3494715 0.98157613
O  -2.19153999 -0.47820212 1.27826209
O  2.19786565 -0.45757101 -1.27880151
O  -1.24279945 -2.4496176 -1.42846796
O  1.41317822 1.9305491 1.07061268
C  1.7547009 3.03016809 -2.44613392
H  2.35290937 2.39931377 -3.11392837
H  0.85255908 3.32095268 -2.99654375
C  -1.48541551 1.80990185 -2.47893761
C  1.54949552 -2.33272617 2.80080195
H  -2.04975298 0.91042963 -2.73140719
H  -0.46946549 1.66507852 -2.85266717
H  1.94178623 -1.33476251 3.02436405
C  -1.78001736 3.01214137 2.44825107
C  1.26442809 -4.44507502 -1.26113494
H  -2.37226602 2.37528124 3.11565791
H  0.26781403 -4.86351269 -1.43349966
H  -0.88048475 3.31079338 2.99871933
H  1.62714631 -4.82642978 -0.30180964
C  2.21185855 -4.81241484 -2.37535918
C  -4.20061425 -0.3341215 -1.85932886
C  4.20588341 -0.29705156 1.85863364
H  -4.05579893 -1.08990826 -2.6389935
H  4.20253311 0.68131373 2.35430936
H  -4.20617702 0.64445105 -2.35456405
H  4.06800476 -1.05448345 2.63795213
C  -2.00926791 -0.54076563 2.6819146
C  2.01578075 -0.52054541 -2.68246272
H  -1.37614657 0.30004033 2.9779505
H  1.48818087 -1.44745467 -2.91488833
H  -1.47321301 -1.46298135 2.91365805
H  1.37485496 0.31466473 -2.97756387
C  -1.52603313 -2.34502425 -2.80255252
C  1.47110037 1.82147571 2.48002731
H  -0.58071337 -2.43316232 -3.35430237
H  2.04380654 0.92709797 2.73173896
H  -1.92747513 -1.3505358 -3.02536033
H  0.45647842 1.66674145 2.85340631
C  -1.22058176 -4.45747034 1.25511195
C  -2.16445969 -4.83696445 2.36826472
H  -0.21988802 -4.86642083 1.42655608
H  -1.57936553 -4.83998323 0.29476249
H  0.60506722 -2.43003078 3.35251961
H  -0.0888408 -2.76860453 1.22925555
H  0.11613327 -2.76727268 -1.23135963
C  -2.48588661 -3.42427469 -3.25321313
H  -2.05308016 -4.41409316 -3.08989011
H  -3.41736271 -3.37111516 -2.68371973
H  -2.71914291 -3.3201966 -4.31595251
C  -5.51522441 -0.56066818 -1.15047662
H  -6.33345311 -0.51609973 -1.87397525
H  -5.52564381 -1.53949852 -0.66968985
H  -5.6758858 0.20908614 -0.39475523
C  -2.12140211 3.04164172 -3.07671174
H  -2.15213742 2.96805866 -4.16651252
H  -3.14227176 3.1624305 -2.70674327
H  -1.55709479 3.93643092 -2.80255789
C  2.53559615 4.26168927 -2.05199148
H  1.93525096 4.89965598 -1.40198784
H  3.45165209 3.98189018 -1.53088463
H  2.80213335 4.82802715 -2.94818056
C  3.3478326 -0.47285173 -3.39194526
H  3.96302858 -1.32637162 -3.09833943
H  3.20648397 -0.5001601 -4.47513427
H  3.89093189 0.43973996 -3.13314357
C  -3.34188808 -0.5060473 3.39106552
H  -3.89330704 0.4017535 3.13300344
H  -3.94910409 -1.36491761 3.09643743
H  -3.2006042 -0.53313849 4.47426861
C  2.51930428 -3.40342824 3.25052436
H  2.75135982 -3.29829637 4.31342193
H  2.0958018 -4.39707839 3.08606423
H  3.450355 -3.34097238 2.68128363
C  5.52246064 -0.51122865 1.14958752
H  6.34032726 -0.45934533 1.87301031
H  5.54185807 -1.48977087 0.66848626
H  5.67591951 0.26021189 0.39408801
C  2.09537817 3.05852963 3.07917342
H  2.12635638 2.98424089 4.16892063
H  3.11523657 3.18914707 2.70974728
H  1.52288418 3.94827515 2.80559923
C  -2.5723142 4.23671319 2.05521592
H  -1.97804377 4.88063319 1.40549515
H  -3.48591557 3.94889404 1.53417036
H  -2.84377047 4.79993237 2.95189303
H  -3.14952702 -4.40531427 2.18437155
H  -1.79273538 -4.47526075 3.32967923
H  -2.26721062 -5.92325597 2.42404978
H  1.83653858 -4.45179398 -3.33578734
H  2.32517741 -5.89750033 -2.43404772
H  3.19269481 -4.37169368 -2.1903846
converged: yes
empdispcorrection: -0.139966311 hartree
orbitalenergy: -6.8872 -6.6925 -6.5924 -6.5708 -6.4568 -1.2431 -1.2216 -1.1427 -1.1155 -1.0435 electronvolt
orbitalenergy: -8.1024 -8.0286 -8.0059 -7.8764 -7.8738 -1.0970 -0.8736 -0.7042 -0.6449 -0.5941 electronvolt
s2: 8.81392195
charge: -0.000000
dipole: 1.611151 -1.604772 0.006379 -144.953715 143.712980 -1.240735 -0.249821 0.248923 -0.000897
quadrupole: 11090.362500 -11361.123326 -270.760826 10558.424057 -10810.729502 -252.305445 5422.529812 -5647.267998 -224.738186 1.803993 -1.893991 -0.089998 -17.258480 23.127559 5.869079 2.518483 -2.492131 0.026352
