program: TURBOMOLE
programVersion: 7.3
title: Local memory allocated for RDGRAD: 8 MiB
elementType: cl
basis: def2-TZVP
elementType: v
elementType: o
elementType: c
elementType: h
method: uhf
method: dft
functional: pbe0
elementType: cl v o c h
basis: def2-TZVP def2-TZVP def2-TZVP def2-TZVP def2-TZVP
correction: disp3
frequency: -0.00 0.0000 0.0000 0.0000 0.0000 0.0000 100.00 100.00 100.00 100.00 100.00 100.00 100.00 100.00 100.00 100.00 100.00 100.00 100.00 100.00 100.31 106.47 109.28 109.87 110.48 117.84 119.40 122.11 122.67 126.65 129.28 131.54 135.03 137.36 140.63 141.66 146.08 147.15 151.28 156.88 158.20 158.35 165.09 169.17 169.91 170.30 171.40 172.02 175.45 181.21 181.82 181.93 186.77 187.38 215.39 215.61 221.44 221.94 235.17 236.01 241.36 244.54 245.17 245.99 246.74 249.37 262.45 262.85 272.64 273.49 273.52 276.26 289.72 290.19 318.59 327.95 328.37 332.94 335.27 355.28 355.82 365.04 414.93 415.24 416.12 420.92 421.07 454.84 455.24 459.58 461.98 467.03 467.18 467.25 467.69 494.33 494.42 497.19 508.52 533.56 571.67 572.00 575.09 588.10 588.25 1083.22 1084.89 1085.06 1086.74 1086.92 1090.56 1111.02 1111.33 1114.33 1114.72 1116.19 1117.81 1127.51 1127.69 1135.37 1139.47 1139.67 1158.54 1172.76 1173.08 1173.83 1174.12 1176.60 1177.66 1180.07 1180.29 1180.33 1180.42 1180.91 1181.01 1199.61 1199.93 1200.42 1200.50 1201.33 1201.36 1203.08 1203.69 1203.77 1204.58 1205.51 1206.83 1458.49 1458.81 1460.13 1460.32 1464.58 1464.96 1468.75 1469.94 1470.02 1470.27 1471.25 1471.74 1478.14 1478.67 1478.74 1479.12 1479.17 1479.50 1481.69 1481.76 1481.93 1481.98 1482.57 1482.78 1489.07 1489.58 1490.66 1490.94 1491.74 1492.05 1497.06 1498.14 1499.90 1500.27 1500.52 1500.90 3010.19 3010.24 3010.59 3010.67 3011.02 3011.44 3025.04 3025.30 3025.41 3025.68 3026.51 3027.60 3079.77 3079.95 3080.32 3080.37 3080.74 3080.77 3085.65 3085.73 3085.91 3086.01 3086.29 3086.32 3094.88 3095.00 3095.18 3095.29 3095.96 3095.99 3116.57 3116.62 3116.95 3116.98 3117.63 3117.66
irintensity: 0.00000 0 0 0 0 0 1.33681 0.00059 0.72722 0.00043 0.00004 0.70335 0.71326 0.00001 0.79975 2.41481 0.00024 1.06786 2.45893 0.00003 2.27532 0.57695 0.00002 0.00002 0.00000 3.35084 0.00013 1.66154 0.00051 0.00062 1.61837 12.18262 14.81853 0.00029 0.00000 0.00002 5.14183 11.21397 0.86551 0.00003 0.37999 0.32396 0.55652 0.00066 0.02552 13.51645 0.00503 0.00110 0.00009 10.13412 6.76895 6.48652 0.00001 0.00001 0.01938 0.05194 0.86709 0.00000 0.00000 0.00000 0.07720 0.00430 0.01828 0.00000 0.00000 0.00000 3.89821 4.09071 0.00000 0.00000 0.00000 2.13283 8.24604 8.56628 0.00001 20.97178 20.48792 0.00001 0.00000 0.00000 0.00000 7.13584 2.02150 2.01119 0.00002 1.46151 1.20309 0.00001 0.00000 0.44532 0.00013 0.00109 0.05762 6.58672 6.20673 0.00001 0.00001 0.29539 0.00002 343.80177 828.41165 830.06570 2.31725 0.00026 0.00025 0.38706 0.00767 0.00074 343.73840 344.85799 0.00418 551.18865 541.54917 0.07152 0.01104 479.63359 0.00063 0.00011 0.00005 780.87274 216.86448 217.46205 0.00011 0.00001 0.80896 0.00000 1.03275 0.45989 0.00001 0.02736 0.00009 0.02825 0.00010 0.00006 0.02495 2.59586 0.00060 0.00126 8.63254 7.93909 0.00014 0.00000 0.00022 0.94548 0.82539 3.91002 0.00001 0.00001 0.21883 0.00005 0.29949 1.99742 0.00000 24.05179 0.00460 5.15718 0.00064 8.34989 0.00117 3.31407 0.00007 0.00017 3.39343 0.00040 3.47518 0.03934 4.57738 0.01840 5.49204 8.06108 0.00129 0.00012 0.27455 0.00043 15.24461 0.00129 15.07871 1.04272 0.00001 12.66148 0.00077 12.65244 0.00002 0.50405 193.00345 0.12342 131.28522 119.99208 0.00079 0.04475 0.01832 37.02562 21.87460 448.95714 0.00372 0.11774 47.88623 1.35101 58.98100 2.49680 67.95987 0.19021 52.90665 0.19501 57.07435 74.21983 0.05875 0.26620 92.44103 0.06663 93.28420 1.38673 0.00156 4.39057 48.66213 24.93776 12.17648 27.76254 7.18865
energy: -7955.764622674 hartree
formula: C12H36ClO18V6
InChI: InChI=1/12CH3O.Cl.6O.6V/c12*1-2;;;;;;;;;;;;;/h12*1H3;;;;;;;;;;;;;/rC12H36O18V6.Cl/c1-19-31(13)20(2)32(19,14)23(5)34(16,24(32)6)27(9)36(18,28(34)10)29(11)35(17,30(36)12)25(7)33(15,21(31)3,22(31)4)26(35)8;/h1-12H3;
73 atoms
Cl -0.00001584 -0.00004632 0.00001759
V  2.60950402 -1.62353054 -0.00659321
V  -2.60922932 1.62335416 0.00665776
V  2.70509962 1.44706237 0.00303922
V  -2.70479125 -1.44718308 -0.00294037
V  0.09932026 3.07472013 -0.00318796
V  -0.09907819 -3.0748757 0.0032098
O  3.94583356 -2.44747251 -0.00445076
O  4.08931492 2.18739299 -0.00047159
O  -4.0889716 -2.18757772 0.0007085
O  0.15122154 4.64377342 -0.00026033
O  -0.15094771 -4.6439332 0.00021603
O  1.39755457 -2.62006228 -1.24162219
O  -1.39732103 2.61998212 1.24171564
O  2.83094542 -0.08975572 -1.23493341
O  -2.83076803 0.08966095 1.23504355
O  2.96177878 -0.09981332 1.23859612
O  -2.9616018 0.0996656 -1.23855557
O  1.5640119 2.51882233 -1.24012951
O  -1.56370532 -2.51898166 1.24018026
O  1.49236552 2.41131339 1.23311484
O  -1.49213165 -2.41148398 -1.23308015
O  -1.34229249 2.50270144 -1.23071583
O  1.34250286 -2.50274215 1.23074978
C  1.90767495 -3.58925661 -2.12086016
H  2.71626573 -3.16431373 -2.72536254
H  2.3042106 -4.44823459 -1.57045506
H  1.11781313 -3.94105138 -2.7926688
C  2.39099953 -0.039814 -2.56529939
C  -2.39094633 0.03973292 2.56544793
H  3.00766471 0.66661785 -3.13066802
H  -3.00789216 -0.66643628 3.1308444
H  2.4791489 -1.02406954 -3.0301628
H  1.34727837 0.2819243 -2.61302087
H  -1.3473306 -0.2823395 2.61329586
C  4.05638531 -0.14194805 2.11772334
C  -4.05662799 0.14172882 -2.11719473
H  4.9979168 -0.23439805 1.5673079
H  -4.09721698 -0.77450204 -2.71595107
H  4.09615933 0.77381914 2.71724839
H  -3.96325819 0.99717788 -2.79432403
H  3.96319461 -0.99798546 2.79412633
H  -4.99783205 0.23518592 -1.56639397
C  2.14958772 3.44103512 -2.12270884
C  -2.14940235 -3.44124886 2.12262814
H  2.83657982 2.92685841 -2.80297104
H  -2.83682196 -2.92717996 2.8025373
H  1.37679356 3.93912716 -2.71799842
H  -1.37672169 -3.93906077 2.71830678
H  2.70942321 4.20611833 -1.57570097
H  -2.70879747 -4.20654913 1.57547526
C  1.22881753 2.05318009 2.56293842
C  -1.22877058 -2.05327112 -2.56291675
H  2.13024434 1.65304138 3.03222514
H  -2.13025426 -1.65307347 -3.03204915
H  -0.90870377 -2.93622006 -3.1256915
H  0.4401716 1.29753527 2.60839763
H  -0.44014426 -1.29761008 -2.60844163
C  -1.16655544 2.09844895 -2.56182252
C  1.16668222 -2.09852268 2.56185994
H  -0.90936265 1.03705327 -2.61032079
H  2.09159555 -2.26712031 3.12302931
H  -2.09164832 2.26661049 -3.12282511
H  0.36827502 -2.67785011 3.03067025
H  -0.36847869 2.67807794 -3.03083137
H  0.90990463 -1.03702801 2.61038391
O  -3.94557111 2.44728043 0.00448944
C  -1.90764012 3.58943083 2.12058572
H  -1.11809172 3.94083613 2.79297022
H  -2.71687903 3.16485268 2.72447052
H  -2.3033475 4.44859996 1.56988729
H  -2.47878106 1.02407572 3.03018954
H  0.90865574 2.93616269 3.12560599
converged: yes
empdispcorrection: -0.109233426 hartree
orbitalenergy: -3.9238 -3.9206 -3.8814 -3.7739 -3.7721 1.6013 1.6033 1.6162 1.6597 1.6603 electronvolt
orbitalenergy: -5.3418 -5.3392 -4.9617 -4.8739 -4.8695 1.5867 1.9386 1.9396 2.1561 2.1584 electronvolt
s2: 12.07757256
charge: -1.000000
dipole: 0.070706 -0.071063 -0.000357 -0.048024 0.048023 -0.000001 0.024074 -0.024123 -0.000048
quadrupole: 7868.628032 -8135.085910 -266.457879 7887.447818 -8153.918573 -266.470755 2878.165925 -3079.511934 -201.346009 -8.236735 8.225073 -0.011662 -4.255089 4.272115 0.017026 1.548524 -1.577454 -0.028929
