program: TURBOMOLE
programVersion: 7.3
title: Local memory allocated for RDGRAD: 8 MiB
elementType: v
basis: def2-TZVP
elementType: o
elementType: c
elementType: h
method: uhf
method: dft
functional: pbe0
elementType: v o c h
basis: def2-TZVP def2-TZVP def2-TZVP def2-TZVP
correction: disp3
frequency: -19.93 0.0000 0.0000 0.0000 0.0000 0.0000 0.0000 100.00 100.00 100.00 100.00 100.00 100.00 100.00 100.00 100.00 100.00 100.00 100.00 100.00 101.57 103.28 112.64 114.16 117.46 123.28 125.95 127.01 132.68 135.67 137.82 140.75 141.45 143.18 144.78 145.73 148.55 155.98 157.45 157.51 158.14 159.37 163.11 164.87 165.85 166.15 167.92 168.81 173.22 174.58 175.86 187.28 189.32 201.91 209.08 226.33 229.47 230.95 231.45 231.48 241.02 245.36 255.84 263.36 268.61 272.38 272.96 274.71 275.04 281.16 281.57 298.50 312.75 313.95 325.85 344.78 354.29 355.03 366.85 417.41 417.76 425.61 427.17 427.82 458.08 459.17 472.85 478.31 479.03 481.36 488.73 490.59 494.05 499.21 500.14 533.81 537.87 595.01 597.12 599.33 609.62 610.47 1083.31 1084.51 1085.18 1090.08 1091.18 1096.70 1102.95 1107.16 1107.34 1109.17 1109.45 1115.21 1123.81 1124.35 1131.18 1139.54 1140.61 1158.07 1174.11 1174.18 1174.20 1174.36 1176.46 1176.69 1180.32 1180.35 1180.46 1180.53 1180.85 1180.92 1196.74 1197.67 1202.40 1202.58 1202.74 1202.91 1203.74 1203.74 1203.95 1204.65 1205.64 1205.72 1456.88 1457.11 1458.87 1458.93 1465.56 1466.23 1476.28 1476.46 1477.07 1477.37 1477.52 1477.75 1478.19 1479.52 1481.51 1481.55 1481.66 1481.67 1485.54 1485.66 1485.82 1485.99 1488.25 1488.45 1493.77 1494.35 1496.66 1496.94 1497.16 1497.29 1507.10 1507.63 1507.66 1508.19 1516.35 1516.40 3024.23 3024.28 3024.82 3024.90 3026.82 3026.92 3042.90 3043.11 3043.24 3043.53 3044.95 3045.73 3100.19 3100.30 3100.72 3100.76 3103.16 3103.23 3108.50 3108.52 3109.13 3109.17 3110.31 3110.34 3120.00 3120.11 3120.98 3121.10 3124.09 3124.13 3141.89 3141.89 3144.65 3144.68 3144.90 3144.93
irintensity: 0.00000 0 0 0 0 0 0 0.08701 0.00001 0.00004 0.02215 0.24227 1.32537 0.00008 1.73237 1.07180 0.00049 0.00010 5.40405 0.00000 0.00000 4.83728 0.00000 0.31484 0.00001 0.00017 0.00000 0.00000 0.04613 0.07226 0.04828 0.36364 0.00001 0.00001 0.00005 0.11048 0.82232 0.00022 1.73673 0.00024 6.67681 0.00003 14.32519 0.00192 0.00045 0.67595 0.00005 0.00014 4.52892 0.00072 3.78733 1.66722 2.06486 2.14154 0.00000 0.00002 1.06426 0.00011 0.05629 0.79618 0.00000 0.00000 0.02257 0.15080 0.00000 0.00003 0.00004 3.27240 3.51564 0.16831 0.10093 0.00001 25.70736 26.77557 0.00000 0.00000 0.00000 0.00001 7.66771 0.03819 0.03419 0.00004 1.14894 0.63853 0.00001 0.00000 0.27317 0.00002 0.00009 0.00007 24.71391 24.55693 5.35289 0.00003 0.00005 0.00004 282.98867 937.36291 854.68570 133.58380 0.00018 0.00006 0.00730 34.38305 33.55925 0.00290 0.00621 639.94797 0.38002 0.00057 0.00043 503.58555 506.87484 0.00013 0.00151 0.00023 742.58510 354.47159 332.79547 0.00006 0.09852 0.00734 0.15140 0.00000 0.00175 21.51212 0.11420 0.00617 0.21008 0.00039 0.00692 1.09963 0.06103 0.00000 0.00126 9.36859 0.00762 5.81111 0.19649 0.55645 0.00002 0.83081 0.00035 2.78054 0.00000 0.66599 0.39572 0.00211 0.00000 0.24898 0.00031 0.00022 2.81031 9.92456 0.00140 11.12212 11.39125 0.00034 0.04350 3.92484 14.09545 2.09961 1.56058 0.00117 9.34741 0.00090 4.45398 0.00178 0.00000 0.04060 0.00006 22.28055 0.00589 13.16121 0.46248 0.00098 0.57289 0.00012 0.01466 1.21102 0.00700 124.09249 90.78775 0.51639 93.42568 0.44763 0.00055 0.00015 13.08499 2.95050 317.02453 0.00003 0.01761 41.28523 4.50888 44.89638 0.63904 52.46109 0.05555 30.77258 4.77340 27.38599 5.32648 25.02678 0.00039 49.25677 0.00427 45.34004 9.49253 0.01624 0.20481 2.48690 0.02431 29.13330 3.97521 20.57564
energy: -7495.549145210 hartree
formula: C12H36O18V6
InChI: InChI=1/12CH3O.6O.6V/c12*1-2;;;;;;;;;;;;/h12*1H3;;;;;;;;;;;;/rC12H36O18V6/c1-19-31(13)20(2)32(19,14)23(5)34(16,24(32)6)27(9)36(18,28(34)10)29(11)35(17,30(36)12)25(7)33(15,21(31)3,22(31)4)26(35)8/h1-12H3
72 atoms
V  -2.21773576 -2.1481523 -0.00283462
V  2.21763494 2.14809394 0.00276643
V  -3.04169393 0.85624973 0.00193717
V  3.041554 -0.85632756 -0.00173043
V  -0.78334524 3.00131685 0.00579034
V  0.78325567 -3.0013522 -0.00589059
O  -3.31423991 -3.26276191 -0.00927938
O  -4.54971333 1.26860121 0.00591101
O  4.54954572 -1.26878957 -0.00504128
O  -1.13024388 4.52596757 0.01565267
O  1.13012717 -4.52601183 -0.0161029
O  -0.78956205 -2.83342834 1.20378314
O  0.78937325 2.83302554 -1.20400142
O  -2.54767456 -0.62645726 1.19686169
O  2.54791753 0.62634319 -1.1968565
O  -2.92204113 -0.72371778 -1.20610742
O  2.92175106 0.72376953 1.20621552
O  -2.12681183 2.15185051 1.20878507
O  2.12686226 -2.1518447 -1.20881329
O  -1.86356858 1.88093004 -1.19549303
O  1.86323942 -1.88092887 1.19550417
O  0.67879041 2.43493582 1.19318783
O  -0.6787004 -2.43437504 -1.19318048
C  -1.07212705 -3.83140442 2.16429505
H  -1.91040814 -3.51941027 2.79391875
H  -1.33413087 -4.77176798 1.67290615
H  -0.1973695 -3.99926892 2.79924707
C  -2.3791356 -0.59405466 2.59410855
C  2.37945521 0.59388771 -2.59411137
H  -2.21130418 0.4312851 2.92464301
H  3.27220173 0.98968697 -3.08661181
H  -3.27187774 -0.98980353 3.08665725
H  -1.5139178 -1.19547352 2.87782483
H  2.21171923 -0.43147229 -2.92463001
C  -3.9514557 -1.01834234 -2.1296455
C  3.95149668 1.01851421 2.12937684
H  -3.63703137 -1.82895005 -2.79378376
H  4.85978395 1.32770844 1.60607585
H  -4.85992829 -1.32765511 -1.60673207
H  4.17989741 0.1348814 2.73255566
H  -4.17968488 -0.13463008 -2.73277705
H  3.63731531 1.82923557 2.79348856
C  -2.86061175 2.93772347 2.12726129
C  2.86097254 -2.93789385 -2.12689177
H  -3.50754505 2.29851616 2.73529102
H  3.48420951 -3.6643092 -1.59922678
H  -2.17571137 3.47891884 2.78690487
H  3.50833637 -2.2988354 -2.73461952
H  -3.48426148 3.66403556 1.59994146
H  2.17629646 -3.47897547 -2.78686208
C  -1.73112264 1.76416051 -2.59214327
C  1.73102633 -1.76434939 2.59219652
H  -2.26933149 2.57772869 -3.08677509
H  2.26973951 -2.57769605 3.08664234
H  0.67681214 -1.8079058 2.87069963
H  -2.1382475 0.80965267 -2.92653144
H  2.13776138 -0.80966157 2.92656418
C  0.62287249 2.22583268 2.58530426
C  -0.62275712 -2.22558786 -2.58533572
H  -0.38995783 1.94292949 2.8748301
H  -0.90802091 -3.14048733 -3.11241486
H  1.30252083 1.41936424 2.86424729
H  0.38995671 -1.94220514 -2.87481001
H  0.90868652 3.14045932 3.11255907
H  -1.30281101 -1.41955152 -2.86453295
O  3.31418952 3.26264635 0.00900079
C  1.07198447 3.83106234 -2.16445576
H  0.19732996 3.99878763 -2.79958523
H  1.91044395 3.51919764 -2.79390268
H  1.33373875 4.7714612 -1.67300566
H  1.51421463 1.1952376 -2.87790189
H  -0.67683069 1.80716862 -2.8704379
converged: yes
nucrepener: 9395.491235425 hartree
empdispcorrection: -0.096281880 hartree
orbitalenergy: -6.9809 -6.9453 -6.8936 -6.8261 -6.8069 -1.3124 -1.3115 -1.3071 -1.3022 -1.2897 electronvolt
orbitalenergy: -8.5333 -8.4739 -8.4201 -8.3926 -8.3587 -1.4018 -1.1442 -1.1418 -0.8237 -0.7962 electronvolt
s2: 12.07664290
charge: -0.000000
dipole: -0.014156 0.014383 0.000227 -0.019698 0.019393 -0.000305 0.001326 -0.001158 0.000168
quadrupole: 8000.853596 -8228.476308 -227.622712 7777.078015 -8005.587453 -228.509438 2895.565903 -3070.554319 -174.988416 -97.402437 97.036472 -0.365965 -6.431171 6.370845 -0.060326 -7.716420 7.293394 -0.423026
