program: TURBOMOLE
programVersion: 7.3
title: Local memory allocated for RDGRAD: 9 MiB
elementType: v
basis: def2-TZVP
elementType: o
elementType: c
elementType: h
method: uhf
method: dft
functional: pbe0
elementType: v o c h
basis: def2-TZVP def2-TZVP def2-TZVP def2-TZVP
correction: disp3
frequency: -0.00 -0.00 -0.00 0.0000 0.0000 0.0000 100.00 100.00 100.00 100.00 100.00 100.00 100.00 100.00 100.00 100.00 100.00 100.00 100.00 100.00 100.00 100.00 100.69 105.39 108.04 109.02 112.40 116.55 118.28 120.27 121.93 123.20 125.88 128.65 129.77 132.85 133.50 137.79 142.17 142.61 145.38 146.16 149.60 151.54 154.38 156.71 160.37 160.62 163.65 166.02 166.83 169.70 173.45 175.05 179.05 179.45 184.14 185.63 187.62 190.30 196.38 203.71 207.34 217.92 222.49 224.89 231.37 234.06 240.96 248.47 249.76 255.66 261.27 268.02 268.38 272.69 276.83 282.61 285.31 286.02 290.90 298.26 300.70 305.83 320.48 320.84 339.95 344.87 355.77 363.67 394.16 396.36 425.15 427.95 436.46 452.78 459.81 463.32 473.92 479.06 483.28 488.40 490.87 494.09 501.44 509.18 519.03 535.50 562.62 581.07 596.25 600.60 605.39 609.94 1076.96 1083.69 1084.03 1084.86 1086.75 1089.34 1093.23 1095.07 1096.29 1101.37 1105.66 1107.65 1109.40 1113.19 1115.91 1118.83 1124.63 1129.70 1134.90 1141.29 1153.88 1170.07 1174.48 1174.59 1176.37 1176.62 1176.84 1178.84 1179.95 1181.01 1181.05 1181.67 1181.83 1182.41 1183.20 1186.25 1187.32 1191.03 1198.11 1200.06 1201.45 1202.45 1203.19 1204.21 1204.78 1205.32 1206.07 1207.01 1208.15 1273.04 1456.58 1457.10 1460.68 1461.21 1463.54 1464.68 1468.20 1469.43 1471.94 1475.38 1476.46 1476.63 1478.43 1479.12 1480.04 1480.68 1481.64 1482.20 1483.11 1484.24 1484.86 1485.56 1485.70 1488.18 1488.34 1489.60 1490.64 1492.27 1493.77 1494.74 1497.21 1499.14 1500.18 1501.05 1502.34 1504.14 1505.16 1507.16 1509.71 1510.97 1515.49 1515.77 1543.61 1685.60 2146.16 2264.99 2998.99 3012.94 3022.88 3023.22 3028.76 3028.97 3030.22 3033.05 3034.49 3035.40 3039.68 3040.08 3041.92 3049.55 3058.55 3076.33 3080.88 3096.86 3097.34 3097.95 3099.03 3104.22 3104.27 3108.38 3109.18 3110.18 3110.69 3111.53 3113.44 3114.06 3114.35 3116.25 3117.88 3118.57 3122.81 3132.63 3138.04 3143.06 3144.45 3147.97 3149.31 3153.54
irintensity: 0.00000 0.00000 0.00000 0 0 0 0.03876 0.24274 0.07263 0.35174 0.08695 2.58695 0.13946 0.70700 2.80688 1.42802 0.90277 0.84993 0.27064 0.11634 1.01325 1.16373 1.65888 2.41665 0.62445 0.66655 1.18476 0.12096 0.38924 0.23775 1.74183 0.71745 0.14118 0.07539 0.20980 0.79348 0.10425 0.27185 0.78531 0.22111 2.02791 2.89810 1.53566 0.11627 0.52568 8.50381 1.37874 1.58413 0.38981 0.11763 0.74003 0.98098 0.65369 0.26971 3.00560 1.61910 2.78789 0.68294 0.88388 2.85550 1.15948 0.12675 2.36276 6.89567 6.56194 2.54833 1.26460 0.80308 0.64452 2.64936 6.00591 1.76960 0.19056 1.82331 1.02485 2.89913 2.98754 0.25853 0.13306 2.16482 2.13235 6.58633 3.58179 8.85938 20.72009 2.70719 2.26673 3.37091 0.01403 4.19120 35.79942 0.17133 1.18465 2.24386 0.43180 0.45861 50.01269 5.52740 1.04563 4.01690 7.05250 12.65055 14.44822 5.20375 9.85720 0.49803 117.42270 230.10491 418.92233 413.17834 985.53414 226.31172 104.57629 8.56668 46.37901 7.51974 60.94640 89.32081 51.52432 5.20964 67.16504 169.51743 274.00421 175.25296 82.86979 413.88478 251.92409 234.51995 82.85380 109.17525 1.44019 601.60426 211.45290 354.13629 48.46674 3.35964 0.40776 6.70334 0.45364 0.54100 0.41502 1.86840 6.29283 0.19377 0.14208 0.99278 14.63777 1.51468 0.24478 2.87386 10.11264 2.36540 0.42617 1.54989 4.44299 2.20888 1.36717 2.37717 2.96260 0.67582 0.24886 2.37732 2.95989 66.64929 8.44782 13.09728 0.71314 17.30850 0.05595 0.74470 1.33906 1.44571 7.13682 6.03538 3.80356 5.46449 12.17447 1.21723 18.22946 6.75605 1.82282 10.66213 5.43580 6.63257 0.27796 3.66319 5.66403 4.29980 1.08009 2.71664 2.44351 2.41074 0.86308 5.72776 5.00609 0.50323 2.96607 8.16078 10.04337 7.55930 9.25527 1.89678 0.76644 0.44014 1.28974 1.60812 68.68127 12.83710 485.88148 5066.39962 72.37085 58.40418 74.18091 35.31079 80.67565 20.97107 25.61805 57.77022 7.95828 72.96287 126.86043 5.00655 62.96855 42.96223 37.15279 40.74607 30.76439 22.82023 28.21275 18.79364 35.24398 27.68427 16.24701 18.41744 15.45645 23.41500 19.13388 34.31517 13.87029 16.73929 3.61206 28.70948 16.88028 4.76219 20.82843 7.37697 9.54719 14.72673 7.85630 12.63877 9.34448 4.13920
energy: -7726.858242275 hartree
formula: C14H44O20V6
InChI: InChI=1/2CH4O.12CH3O.6O.6V/c14*1-2;;;;;;;;;;;;/h2*2H,1H3;12*1H3;;;;;;;;;;;;/q;;;;;;;;;;;;2*-1;;;;;;;;;;;2*+1/rC14H44O20V6/c1-21-35(15,22-2)25(5)37(17,26(35)6)29(9)39(19,30(37)10)33(13)40(20,34(39)14)31(11)38(18,32(40)12)27(7)36(16,23-3,24-4)28(38)8/h21,23H,1-14H3
84 atoms
V  3.08244965 1.76574213 -0.10671899
V  -3.44693187 -0.66508504 -0.21151094
V  1.81893647 -2.77702446 0.15106612
V  -2.64956959 2.28480485 0.35491402
V  -1.25891056 -2.89499692 -0.32085659
V  0.34723901 3.12778001 0.47980139
O  4.19762344 2.85789465 -0.16812827
O  2.46693588 -4.20660772 0.16068901
O  -3.71611793 3.39548584 0.63485102
O  -1.75389736 -4.33104626 -0.69160563
O  0.59751923 4.61185149 0.90579758
O  1.83070717 2.13940704 1.37975788
O  -2.33475403 -1.69430492 -1.5005913
O  2.36259918 -1.53709959 1.49190406
O  -2.9644151 1.02429247 -1.11416893
O  3.35572762 0.49341767 -1.55075468
O  -3.43454974 0.67803504 1.24804061
O  0.10647701 -3.1729139 1.087895
O  -1.25403795 3.23699095 -0.69544738
O  0.43140407 -2.34280032 -1.18175698
O  -1.0547054 2.19242501 1.49874258
O  -2.41450948 -1.90626507 0.92106652
O  1.44180472 2.43522789 -0.99023785
C  2.348084 2.56760564 2.62383045
H  3.13311723 1.88143268 2.95051922
H  2.76380842 3.57504766 2.53319954
H  1.5552307 2.58533828 3.37595664
C  1.86526197 -1.4421098 2.80145158
C  -2.69054165 1.18290332 -2.48526995
H  0.77561382 -1.53266045 2.8184179
H  -3.60710929 1.03987788 -3.06459142
H  2.29049706 -2.22367834 3.44108194
H  2.13809528 -0.46943192 3.22534562
H  -2.30467554 2.18399871 -2.67771804
C  4.10239694 0.81880576 -2.69486728
C  -4.49989924 0.83154433 2.16413006
H  3.89525074 0.10217247 -3.49900414
H  -4.87505233 -0.14737904 2.47529584
H  3.8545073 1.81861 -3.06524897
H  -5.32000761 1.39200948 1.70854401
H  5.17927836 0.80398264 -2.48589993
H  -4.15441123 1.37749998 3.04792705
C  0.03768491 -4.27053124 1.97403374
C  -1.54179315 4.43758937 -1.38192818
H  0.68514107 -4.09298002 2.83809902
H  -1.73353165 5.24605812 -0.67197379
H  -0.98728668 -4.41021769 2.32706078
H  -2.42695352 4.30940252 -2.01256148
H  0.36553588 -5.18309963 1.46985801
H  -0.6950708 4.71972515 -2.01501493
C  0.58500038 -1.8048078 -2.47551899
C  -0.90572079 1.5354165 2.73717605
H  -0.30920351 -1.23977887 -2.74380533
H  -1.74546886 0.85846846 2.89567719
H  -0.8752687 2.26783014 3.54891374
H  0.7338987 -2.6065701 -3.20528022
H  0.01881215 0.95415787 2.73733048
C  -2.47202205 -2.04611494 2.31994775
C  1.1759013 2.45547221 -2.37127968
H  -2.93501491 -1.1659793 2.76534792
H  0.10374138 2.56429644 -2.53894696
H  -3.06126743 -2.92910277 2.58453616
H  1.50759878 1.51737284 -2.82071825
H  -1.46476022 -2.15053768 2.72725993
H  1.70229503 3.28817679 -2.84842499
O  -4.93052901 -1.09674535 -0.44606157
C  -2.89718045 -2.21725703 -2.6881873
H  -2.10965619 -2.63280576 -3.32393926
H  -3.41395759 -1.42810432 -3.24057867
H  -3.61144666 -3.01072412 -2.45456508
H  -1.94381245 0.45365847 -2.80827791
H  1.44074303 -1.12742467 -2.50273001
O  3.28151899 -1.90099361 -1.00472611
C  3.98495186 -2.65538288 -1.97519638
H  4.21215134 -3.63307653 -1.5525318
H  3.38739782 -2.79228865 -2.88286706
H  4.9160249 -2.1454912 -2.23632276
O  3.88959822 0.34764983 1.11430885
C  5.23435531 -0.05577495 0.91282147
H  5.87479389 0.81407542 1.05738602
H  5.49467525 -0.83036512 1.63717975
H  5.38103279 -0.44718717 -0.09674273
H  3.27389101 -0.49241536 1.25831069
H  3.31992862 -0.87691877 -1.23836594
converged: yes
empdispcorrection: -0.111889920 hartree
orbitalenergy: -6.8636 -6.8165 -6.7813 -6.7336 -6.5713 -1.4378 -1.2828 -1.1792 -1.1588 -1.1219 electronvolt
orbitalenergy: -8.3524 -8.3193 -8.2835 -8.1860 -8.0640 -1.2439 -1.0740 -0.9138 -0.8423 -0.7452 electronvolt
s2: 12.07745614
charge: 0.000000
dipole: -2.329884 3.516746 1.186862 40.342660 -40.858873 -0.516213 20.738956 -21.118328 -0.379372
quadrupole: 10961.060100 -11193.888628 -232.828528 9311.057161 -9568.158583 -257.101421 3377.686482 -3574.395502 -196.709019 -86.415411 80.096718 -6.318692 -238.415765 233.764670 -4.651095 282.486852 -290.464924 -7.978072
