program: TURBOMOLE
programVersion: 7.3
title: Local memory allocated for RDGRAD: 7 MiB
elementType: v
basis: def2-TZVP
elementType: o
elementType: c
elementType: h
method: uhf
method: dft
functional: pbe0
elementType: v o c h
basis: def2-TZVP def2-TZVP def2-TZVP def2-TZVP
correction: disp3
frequency: -0.00 0.0000 0.0000 0.0000 0.0000 0.0000 100.00 100.00 100.00 100.00 100.00 100.00 100.00 100.00 100.00 100.00 100.00 100.00 100.00 100.00 100.00 104.05 108.93 110.40 113.40 116.03 126.30 131.58 132.19 135.56 139.27 140.36 141.96 146.69 149.05 155.58 156.10 156.69 158.02 161.25 163.99 164.42 166.92 170.48 173.13 175.60 183.64 184.47 186.57 188.38 198.63 200.38 201.17 204.04 206.69 210.13 210.95 225.65 232.41 236.38 248.00 252.84 255.10 256.83 267.58 270.98 272.91 274.78 284.14 291.22 293.01 299.67 319.55 325.59 352.33 359.08 362.97 365.95 422.77 430.38 436.67 445.48 454.91 466.33 474.19 481.83 488.18 488.27 496.28 510.58 522.40 533.18 566.34 580.95 599.81 605.10 606.52 1079.49 1082.44 1086.62 1088.00 1091.92 1094.60 1097.24 1099.49 1105.08 1105.82 1112.07 1113.64 1115.62 1127.22 1128.87 1135.83 1154.12 1170.44 1171.19 1174.21 1174.57 1175.95 1176.31 1178.08 1179.78 1180.08 1180.48 1180.62 1181.43 1182.34 1184.84 1189.80 1191.17 1202.31 1202.45 1204.33 1204.68 1204.86 1205.12 1205.68 1206.19 1234.99 1290.67 1455.59 1458.85 1461.71 1462.97 1466.82 1467.77 1469.25 1469.70 1476.02 1476.88 1477.65 1478.43 1479.27 1480.63 1481.10 1481.44 1482.68 1482.87 1485.10 1485.43 1487.65 1487.80 1488.73 1488.77 1494.81 1494.98 1498.74 1499.35 1499.50 1501.38 1501.74 1508.05 1508.68 1511.57 1515.44 1515.85 1536.31 1552.90 2217.64 2335.54 3010.11 3010.41 3024.96 3025.35 3027.46 3027.60 3041.22 3041.44 3043.08 3043.30 3043.62 3044.88 3075.42 3075.67 3084.73 3085.10 3100.46 3100.77 3103.36 3103.52 3108.25 3108.40 3109.94 3110.09 3115.17 3115.62 3117.21 3118.36 3120.89 3120.94 3141.92 3142.01 3143.01 3143.22 3148.75 3149.70
irintensity: 0.00000 0 0 0 0 0 0.01536 0.03452 1.58615 0.60263 0.33675 2.51915 0.71215 1.18020 0.38422 0.17331 2.23657 1.61357 0.50677 1.37997 0.43738 0.06850 0.21425 1.70309 0.73863 0.17984 0.87063 0.29556 0.15599 0.07933 1.40441 1.22813 5.05353 0.08741 0.57879 6.17346 0.65042 1.49469 0.32293 4.46575 0.78057 0.33086 0.23578 0.03801 0.21025 8.72681 0.22744 0.12525 1.52206 1.55528 4.98165 7.48609 2.76946 0.21879 0.01916 3.67200 3.90102 2.31806 0.69656 0.13218 0.17710 1.73539 0.61150 0.16558 1.51934 2.27632 1.05194 6.01531 2.17389 0.12326 0.55143 16.36729 2.76532 16.89254 4.98893 4.12890 1.19029 16.85595 0.03336 2.07065 0.11637 51.07296 0.47636 1.97615 0.06137 4.99750 11.01592 22.24478 0.19635 4.67780 143.78559 150.86214 121.41641 650.81932 767.84466 117.81407 41.90893 46.78764 105.60809 15.09295 43.71859 27.37015 157.66019 145.83804 224.08686 48.53025 402.05282 101.28053 61.22658 339.40774 437.43328 117.35333 365.32498 82.71702 4.70853 4.47860 0.18964 0.99379 12.50154 10.14592 76.02097 7.22623 0.96257 0.12792 0.30094 3.97943 6.25167 1.35634 7.48231 2.89078 3.11504 2.99387 3.21695 0.89635 0.80868 0.29255 1.24808 0.63425 150.35524 11.66556 26.07799 5.68575 0.24064 0.08424 3.51465 1.62455 1.96983 5.87074 1.10010 7.83064 3.80851 0.87773 1.60439 11.60554 20.42062 20.32437 3.24655 2.24550 0.06035 0.19923 0.58402 1.17768 2.84271 6.38158 1.43928 0.99812 3.09838 1.37249 1.89908 10.42683 10.89095 20.41498 11.83263 0.69989 2.54264 2.74707 1.12950 48.80979 401.04941 4714.00414 13.63213 95.94542 82.26052 25.59685 84.82562 26.93360 44.94419 48.61843 114.51631 25.15656 13.00324 66.24440 10.89151 67.86900 21.34643 46.48426 18.66609 24.28970 18.63264 28.67424 7.62725 27.72910 14.96568 18.08015 17.82566 27.85376 39.17103 0.37940 8.37166 22.43379 6.43207 12.51423 7.96648 10.25534 18.72697 0.43660
energy: -6477.598432704 hartree
formula: C12H38O17V5
InChI: InChI=1/2CH4O.10CH3O.5O.5V/c12*1-2;;;;;;;;;;/h2*2H,1H3;10*1H3;;;;;;;;;;/q;;;;;;;;;;2*-1;;;;;;;;;2*+1/rC12H38O17V5/c1-18-30(13,19-2)22(5)32(15,23(30)6)26(9)34(17,27(32)10)28(11)33(16,29(34)12)24(7)31(14,20-3,21-4)25(33)8/h18,20H,1-12H3
72 atoms
V  0.1024958 -2.96495476 -0.00061087
V  -2.53431171 -1.33683749 -0.2081749
V  2.30706858 1.92847462 -0.02275368
V  -2.43825998 1.7673938 0.02381178
V  2.6225857 -1.16167237 0.20541024
O  0.15516504 -4.52711098 -0.00013892
O  -3.92299739 -2.00391998 -0.48498195
O  3.61087666 2.78646733 0.11474511
O  -3.79989418 2.53089549 -0.1116348
O  4.05510097 -1.73140567 0.47702289
O  1.4220502 -2.30034115 1.32278513
O  -1.2705332 2.95544705 -1.18081083
O  -1.35406531 -2.20158076 1.09586099
O  1.13435372 2.48005997 -1.43425385
O  -1.2580127 -2.39100927 -1.32489176
O  1.06108987 3.03308139 1.18333642
O  -2.92823793 0.14298241 1.06515052
O  2.91014044 0.34380417 -1.06621458
O  -2.1129478 0.28377648 -1.22970155
O  2.08885181 0.42453855 1.2292396
O  -1.30701925 2.39873649 1.43565124
O  1.50372387 -2.10516933 -1.09776543
C  1.94995537 -3.10450878 2.35675464
H  2.37444599 -2.47089024 3.14153649
H  1.16195019 -3.7252002 2.79227832
H  2.73704311 -3.75807004 1.97179527
C  -1.42968077 -2.13150394 2.49924472
C  1.4045313 2.30687717 -2.80055339
H  -0.42872862 -2.16007857 2.93110099
H  1.5889817 1.25545296 -3.04278188
H  -1.90846965 -1.19841174 2.80089951
H  -2.00889332 -2.97635682 2.88281343
H  0.54781097 2.64874706 -3.39214249
C  -1.73096216 -3.230512 -2.35750257
C  1.20596345 4.44426679 1.13628271
H  -2.1987702 -2.6281105 -3.14221726
H  2.19523989 4.69869305 1.51543541
H  -0.90288489 -3.79631328 -2.79339464
H  0.43936364 4.91210392 1.75851621
H  -2.47114923 -3.9358356 -1.97088449
H  1.1173509 4.81200678 0.11065406
C  -4.09769086 0.10779362 1.85652368
C  4.07940352 0.39108962 -1.85734811
H  -4.98581919 0.22707291 1.23049426
H  4.95713337 0.57030426 -1.23096653
H  -4.16638875 -0.84885427 2.38297192
H  4.00219314 1.19543889 -2.59382929
H  -4.0761718 0.91434052 2.59436432
H  4.21419824 -0.55761076 -2.38536851
C  -1.77405322 0.31172389 -2.59894933
C  1.74921126 0.42823638 2.59860319
H  -1.63925138 1.34394996 -2.92286782
H  0.86708087 -0.19365958 2.76453659
H  1.54035965 1.44810127 2.92239611
H  -2.57579265 -0.14132097 -3.18865372
H  2.58171753 0.03440179 3.188212
C  -1.56537785 2.20893729 2.80195705
C  1.57364708 -2.0305646 -2.5011925
H  -1.6798123 1.14773396 3.04492713
H  1.9904758 -1.06839349 -2.80329647
H  -0.73321041 2.60706048 3.39344873
H  0.57633776 -2.12417492 -2.93224151
H  -2.47682961 2.73625089 3.10433076
H  2.20636836 -2.83605895 -2.88492468
C  -1.50787335 4.353946 -1.13078308
H  -2.51103771 4.54388675 -1.51130101
H  -0.77257847 4.87251866 -1.75060275
H  -1.44518152 4.72424031 -0.10417297
H  2.27903326 2.89316357 -3.10343731
H  -0.84928156 -0.24489371 -2.76463485
H  -0.24390605 2.76147939 -1.24338517
H  0.04967722 2.77157599 1.24518455
converged: yes
nucrepener: 8192.654452886 hartree
empdispcorrection: -0.094632567 hartree
orbitalenergy: -6.9792 -6.7805 -6.7299 -6.6826 -6.6055 -1.3085 -1.2814 -1.1967 -1.1687 -1.0675 electronvolt
orbitalenergy: -8.3100 -8.2691 -8.1742 -8.1454 -8.1330 -1.1873 -0.9351 -0.7866 -0.7159 -0.6548 electronvolt
s2: 8.81394223
charge: 0.000000
dipole: -0.441235 0.398826 -0.042409 5.836012 -4.563884 1.272127 -0.138140 0.141060 0.002920
quadrupole: 6864.327309 -7080.601744 -216.274435 6889.030676 -7083.015549 -193.984873 2758.346413 -2925.503383 -167.156969 -5.834346 5.089061 -0.745286 -178.044908 171.523466 -6.521442 -3.427963 3.192391 -0.235572
