program: Gaussian 09
title: 000050302
version: EM64L-G09RevD.01
frameworkgroup: C1[X(C24H25F3N4OS)]
method: RPBEPBE
basis: SDD
operation: Freq
keyword: #p
keyword: freq=noraman
keyword: PBEPBE/SDD
title: #p freq=noraman PBEPBE/SDD
converged: YES YES NO NO
title: Mulliken charges:
elementType: S F F F O N N N N C C C C C C C C C C C C C C C C C C C C C C C C H H H H H H H H H H H H H H H H H H H H H H H H H
charge: 0.275433 -0.166049 -0.158074 -0.153377 -0.285207 -0.331527 -0.105940 -0.095531 -0.354153 0.191724 0.178985 0.506453 -0.816506 -0.098800 -0.578849 -0.343731 -0.402078 0.317444 0.152735 -0.343863 0.412562 -0.334987 -0.326152 -0.382481 -0.246079 0.231729 -0.387706 -0.342405 -0.671081 -0.672859 -0.206616 -0.211403 -0.240645 0.289212 0.320723 0.231377 0.197821 0.242536 0.238683 0.273072 0.330443 0.228949 0.191342 0.206249 0.189291 0.273513 0.244071 0.268740 0.274918 0.205015 0.225525 0.208478 0.205323 0.227873 0.207198 0.235161 0.237025 0.236493
chargesum: 0.00000
title: Mulliken charges with hydrogens summed into heavy atoms:
elementType: S F F F O N N N N C C C C C C C C C C C C C C C C C C C C C C C C
charge: 0.275433 -0.166049 -0.158074 -0.153377 -0.285207 -0.331527 -0.105940 -0.095531 -0.023710 0.191724 0.178985 0.506453 -0.206570 -0.098800 -0.578849 0.085468 0.079141 0.317444 0.152735 -0.070791 0.412562 0.085304 0.069389 -0.108967 -0.002008 0.231729 -0.118965 -0.067487 -0.032064 -0.032465 0.028544 0.025622 -0.004151
polarizability: 4.24787635e+02 1.39147125e+01 3.65745315e+02 1.95763411e+01 -3.20575352e+00 1.96994024e+02
1716.lowfreq: -0.0769 -0.0010 -0.0002 0.0009 1.4198 4.3373 13.4127 18.1830 19.7577
frequency: 13.3097 18.0758 19.7323 32.4596 39.0477 44.2552 52.5365 56.3152 67.7058 70.4445 76.0065 79.8623 85.8191 91.0105 117.7628 148.6895 157.2723 171.5893 189.4689 192.2500 209.8639 214.3370 231.0395 255.6282 264.4332 268.2452 288.0653 289.3390 294.2942 305.7235 316.3110 332.1055 352.2465 378.2995 388.4012 403.0184 407.6764 412.4285 430.7022 445.5707 461.4614 466.8218 479.9782 507.3422 520.3228 532.6741 547.9869 592.7967 609.9028 612.8365 619.2946 628.6305 640.1129 659.9430 682.2058 696.4879 706.5052 713.8318 726.3269 739.0792 750.5744 761.1759 763.4880 774.3350 787.2908 794.9891 799.1692 809.2135 840.2828 845.3130 914.2463 917.8238 920.8535 930.6045 968.0570 975.4814 983.7154 989.2996 990.0327 992.3575 996.9039 998.7615 1003.8831 1020.7624 1030.9662 1039.0732 1062.9380 1068.4722 1074.3427 1075.4778 1077.6478 1084.7580 1105.5047 1119.5013 1125.1078 1142.0025 1156.4239 1172.2621 1174.5030 1179.4245 1185.1143 1207.3836 1208.5309 1229.5148 1251.2329 1270.2926 1273.6946 1281.2023 1292.5319 1303.2772 1307.9307 1319.9203 1325.7324 1333.2659 1351.8157 1362.6744 1372.4382 1378.0756 1383.3716 1387.1391 1387.6195 1395.8540 1424.7770 1443.3359 1445.2024 1445.4659 1453.9728 1461.9932 1463.7082 1472.0842 1479.8339 1483.4987 1484.4800 1488.7649 1490.4593 1491.8952 1528.9489 1548.9006 1578.7705 1593.9737 1595.9773 1600.0610 1609.0372 2855.6646 2867.2036 2903.2138 2981.5154 2982.1671 3024.3638 3028.2184 3030.1858 3032.0625 3034.0585 3073.1391 3074.9846 3090.1511 3090.8252 3092.1948 3122.1949 3136.0634 3146.1191 3151.9722 3159.6435 3169.4924 3169.8671 3178.4048 3184.7107 3519.4510
redmass: 3.9386 4.3307 5.2908 6.0998 6.1097 5.3477 5.1065 5.6634 5.1547 7.7564 3.2463 2.6643 2.7969 3.8946 4.8418 5.9495 3.6384 2.3168 4.4812 2.8747 4.0526 1.6112 3.3647 3.3339 4.1560 1.9448 3.8544 4.8591 4.0627 3.6260 4.1743 6.5202 7.3956 4.4934 5.8889 3.5015 2.8952 7.2394 8.6305 3.7605 6.6261 4.1211 5.9972 3.9525 3.9199 5.1537 5.8354 6.9469 7.0112 7.2393 12.4562 5.3737 1.2110 6.5301 5.3241 2.8719 3.7401 4.5224 2.8622 2.5383 2.6450 4.2072 3.5755 2.1462 2.9556 1.1466 1.2847 1.7871 2.5159 1.3136 1.7683 1.9199 1.4221 1.4058 7.9168 1.3998 1.6912 6.2241 2.3079 4.1714 1.3574 5.8754 6.3467 2.8748 4.1443 3.8845 3.7388 1.9030 2.6335 1.9620 1.9518 2.1067 3.1580 2.0691 1.7811 1.4934 1.9346 1.8471 1.1222 2.0052 1.1633 1.7669 1.9846 1.4939 1.4499 2.0579 2.5799 1.1722 1.2074 1.2064 4.0731 1.4401 1.5510 3.4689 6.8156 1.3201 1.3026 1.3420 9.2959 1.2466 1.2428 3.6167 3.3919 1.5292 1.5914 1.3505 1.7402 1.0550 1.0573 1.0617 1.0609 1.9756 1.1380 1.1525 1.9044 1.4020 4.3953 6.6086 7.2036 6.2942 6.8010 7.0367 6.1478 1.0720 1.0714 1.0693 1.0356 1.0357 1.0596 1.0868 1.0633 1.0884 1.0909 1.0985 1.0981 1.1003 1.1003 1.1052 1.1011 1.0855 1.0893 1.0871 1.0937 1.0966 1.0932 1.1001 1.0982 1.0780
irintensity: 0.2853 0.1590 0.5251 0.8939 0.1255 0.1454 1.1562 0.4122 0.4860 4.5679 0.1305 0.4728 0.1966 0.3447 9.9403 1.7811 1.5423 6.0935 1.2555 0.7586 0.6249 0.7325 2.5982 1.7392 4.8898 1.1914 1.9720 3.9966 0.2343 7.3050 6.3702 4.0000 1.1835 2.2623 2.0425 9.0294 0.3940 1.1087 4.2490 4.3700 5.0165 8.1674 4.6575 11.8385 0.9598 3.5375 9.9115 0.9588 4.2629 3.5277 22.6686 39.2786 64.7602 6.3715 6.2628 31.0810 27.6235 5.7615 2.8711 26.9354 6.2905 8.1207 23.4958 54.4572 45.2159 4.7454 6.5019 65.1788 13.2044 1.4843 0.2319 0.2639 6.2803 6.0401 8.0272 0.5209 62.4316 1.1702 3.2357 135.1711 2.5394 61.7157 106.5307 12.3113 39.3264 19.6823 57.6436 31.9824 26.7502 23.9687 36.3137 3.2990 35.7101 58.5193 8.1845 30.7419 39.0333 20.1444 3.1596 49.0501 2.7964 48.9109 26.5312 46.0631 7.9477 93.9464 167.9096 6.1704 16.2421 8.1487 37.9046 3.7944 1.4182 22.7740 42.6903 5.4445 4.6413 1.8497 1.0626 27.9113 21.8620 20.5641 31.4164 31.6266 13.8256 6.7081 36.3643 7.8235 1.8467 7.3260 10.6259 100.9113 52.5964 28.2784 62.8919 5.6648 239.9700 29.3358 20.8121 3.6493 115.7580 8.7805 23.1470 54.0558 126.4911 78.6334 35.5211 32.3978 41.0259 1.9359 11.1029 23.5338 25.0119 37.7202 86.6321 39.5016 46.8172 13.9095 8.0128 0.4460 7.5856 4.7526 27.0033 9.3853 3.5441 6.0386 5.8150 27.0633
temp: 298.150 k
press: 1.00000 atm
elementType: 16 9 9 9 8 7 7 7 7 6 6 6 6 6 6 6 6 6 6 6 6 6 6 6 6 6 6 6 6 6 6 6 6 1 1 1 1 1 1 1 1 1 1 1 1 1 1 1 1 1 1 1 1 1 1 1 1 1
symmnumber: 1
zpe: 1178707.6 jmol-1
zpe.correction: 0.448946 hartree
zpe.thermalcorrener: 0.480467 hartree
zpe.thermalcorrenthalpy: 0.481411 hartree
zpe.thermalcorrgfe: 0.382035 hartree
zpe.sumelectzpe: -1918.975711 hartree
zpe.sumelectthermal: -1918.944189 hartree
zpe.sumelectthermalent: -1918.943245 hartree
zpe.sumelectthermalfe: -1919.042622 hartree
dipole: -0.6953 7.6357 -0.3423
dipole: 7.6749
quadrupole: -194.1622 -192.6893 -200.5267
quadrupole: 22.7969 -9.2971 -0.0078
quadrupole: 1.6306 3.1034 -4.7340 22.7969 -9.2971 -0.0078
hfenergy: -1919.4246566 hartree
pointgroup: C01 [X(C24H25F3N4O1S1)]
dipole: -0.1725399 3.0145753 0.0126604 debye
polarizability: 425.5809157|10.9269555|364.8531341|20.4353533|4.388854|197.0929241 unknown
InChI: InChI=1S/C24H25F3N4OS/c1-3-30(4-2)14-13-28-23(32)20-18-15-33-22-17(11-8-12-19(22)24(25,26)27)21(18)31(29-20)16-9-6-5-7-10-16/h5-12,28H,3-4,13-15H2,1-2H3
charge 0 multiplicity 1
58 atoms
S  1.878692 -2.667358 0.416718
F  6.416756 -3.036495 0.556897
F  4.474984 -3.507325 1.616265
F  4.722247 -3.999859 -0.585575
O  -2.610123 -1.703742 -0.970881
N  0.598368 1.512454 -0.217061
N  -6.827047 -0.755749 0.343962
N  -0.782959 1.399787 -0.361314
N  -3.385064 0.487126 -0.68857
C  1.234674 0.268802 -0.3569
C  0.211084 -0.673298 -0.569397
C  2.67149 -0.033582 -0.358532
C  0.47003 -2.13362 -0.749854
C  -1.007898 0.06373 -0.576121
C  3.099533 -1.360569 -0.009336
C  -5.45489 -0.235385 0.545351
C  -4.805878 0.133618 -0.815325
C  4.495203 -1.643756 0.032668
C  -2.390607 -0.463518 -0.760882
C  3.644639 0.928571 -0.739064
C  1.127028 2.794406 0.172335
C  -6.839719 -2.210488 0.019182
C  -7.773965 -0.388991 1.429576
C  5.445596 -0.649933 -0.299409
C  5.018404 0.629521 -0.703169
C  5.00853 -3.01489 0.395629
C  0.675513 3.952853 -0.500866
C  2.038486 2.891195 1.250186
C  -8.054784 -2.6249 -0.832204
C  -8.208251 1.08808 1.372723
C  1.159008 5.217534 -0.102133
C  2.522974 4.160176 1.633242
C  2.087732 5.325543 0.959586
H  0.770791 -2.393651 -1.778827
H  -0.405962 -2.737086 -0.46996
H  -4.795315 -0.969926 1.065015
H  -5.496231 0.667487 1.182004
H  -4.874494 -0.731483 -1.497132
H  -5.358063 0.974094 -1.270285
H  3.319131 1.919927 -1.065447
H  -3.100404 1.449733 -0.48668
H  -5.91508 -2.440486 -0.541811
H  -6.799185 -2.829932 0.950361
H  -8.672687 -1.022417 1.316501
H  -7.350388 -0.621015 2.439895
H  6.510398 -0.892589 -0.25656
H  5.752585 1.387195 -0.991741
H  -0.0459 3.851424 -1.316541
H  2.35184 1.990633 1.786923
H  -9.010131 -2.43118 -0.311015
H  -8.065192 -2.059025 -1.779977
H  -8.012848 -3.705653 -1.063895
H  -7.350736 1.775067 1.4953
H  -8.682615 1.305832 0.39998
H  -8.931364 1.310835 2.179667
H  0.812174 6.116836 -0.622076
H  3.227925 4.237829 2.46764
H  2.462464 6.308416 1.264232
