program: Gaussian 16
title: AWUYEX
version: ES64L-G16RevC.01
frameworkgroup: C1[X(C24H21N2O6)]
method: RwB97XD
basis: Gen
operation: Freq
keyword: #P
keyword: Geom=AllCheck
keyword: Guess=TCheck
keyword: SCRF=Check
keyword: GenChk
keyword: RwB97XD/ChkBas
keyword: Freq
converged: YES YES NO NO
title: Mulliken charges:
elementType: C H C H C H C H C C N C C O O O C O C H H H C C C C H H C H H C H H H H H H C H C H C H C H C C N C C O O
charge: -0.137255 0.197783 -0.128444 0.183379 -0.131264 0.183140 -0.130421 0.197496 -0.010126 -0.006905 -0.550515 0.616694 0.614118 -0.554815 -0.540030 -0.115312 0.689185 -0.528743 -0.355697 0.144317 0.144180 0.136624 -0.099994 -0.220085 -0.218092 -0.239646 0.153718 0.137623 -0.236880 0.166475 0.139789 -0.223597 0.130265 0.123436 0.126411 0.122206 0.110831 0.128055 -0.175285 0.166123 -0.153146 0.159271 -0.154438 0.159333 -0.172575 0.165396 -0.008616 -0.008873 -0.771850 0.572531 0.575917 -0.682176 -0.689516
chargesum: -1.00000
title: Mulliken charges with hydrogens summed into heavy atoms:
elementType: C C C C C C N C C O O O C O C C C C C C C C C C C C C N C C O O
charge: 0.060528 0.054935 0.051876 0.067075 -0.010126 -0.006905 -0.550515 0.616694 0.614118 -0.554815 -0.540030 -0.115312 0.689185 -0.528743 0.069423 -0.099994 0.071255 0.088173 0.014056 0.011738 0.015289 -0.009162 0.006125 0.004895 -0.007180 -0.008616 -0.008873 -0.771850 0.572531 0.575917 -0.682176 -0.689516
polarizability: 3.28763635e+02 -7.45890756e-01 4.16755899e+02 2.59370165e+01 -2.10470843e+01 4.47358578e+02
1716.lowfreq: -20.7923 -10.6312 -4.9820 -0.0006 -0.0002 0.0007 15.1450 26.8350 35.2922
frequency: 7.5128 24.7315 34.7110 42.6592 45.9668 53.4060 64.6682 69.8071 79.5476 103.6880 116.8994 136.3626 143.8118 160.5302 185.2162 186.6820 195.1974 210.4428 214.9064 248.8524 249.9733 255.5370 266.2026 297.2282 319.5944 338.5524 361.7997 363.1505 381.2279 384.8941 397.5424 415.8842 422.7048 444.1172 471.6159 473.4697 478.6466 531.6328 532.9922 547.3351 569.6795 572.1443 604.4962 666.2989 668.2317 685.4057 694.7641 697.3625 699.7291 724.5032 728.5333 735.2906 739.0171 765.6275 769.1867 805.5654 811.0708 814.2259 815.0534 816.4183 841.6119 853.1064 862.2230 877.5386 899.7721 920.3681 921.9541 925.1030 959.6656 989.2119 1000.0573 1002.5229 1004.3952 1013.1916 1026.3682 1036.7857 1042.1031 1046.5603 1054.9560 1064.1307 1097.0392 1101.9281 1104.1951 1110.1995 1132.4898 1149.9873 1165.3818 1169.5566 1179.1578 1186.8717 1188.8592 1193.2355 1202.9181 1228.4604 1240.0596 1246.8139 1248.8841 1295.2691 1317.7963 1319.6347 1327.6445 1331.0231 1336.4221 1362.8220 1383.6958 1388.4582 1396.0557 1403.3346 1405.2894 1409.2221 1423.3497 1432.1349 1479.7319 1482.7630 1484.8030 1491.9221 1502.0778 1510.0650 1512.3329 1517.2055 1517.8360 1520.4353 1521.2804 1675.5771 1690.7878 1691.9630 1696.2928 1699.4177 1794.1853 1831.3638 1850.0013 1893.8524 3059.0243 3070.2149 3072.1372 3084.6702 3087.8411 3093.7112 3111.1393 3117.4656 3121.9224 3163.3984 3167.6455 3172.8742 3187.6042 3215.1838 3223.6827 3231.1545 3233.1955 3238.6175 3242.3992 3250.4774 3254.8387
redmass: 5.8055 6.8461 6.1735 6.5427 6.0218 7.2579 6.1583 5.9265 7.2394 4.4344 6.3427 5.0523 5.0575 4.5969 4.2056 7.0819 6.1542 1.4830 6.3157 6.9746 5.1515 5.6888 5.9133 1.3663 11.9272 2.7599 8.1021 9.7188 2.8129 2.2452 2.4637 3.2324 3.0607 4.7347 4.5932 4.9304 3.1378 1.8818 7.2999 7.1993 6.5978 9.2120 8.2775 4.2619 12.6220 5.0543 4.9339 4.9582 7.9297 6.6623 5.8927 2.7528 2.2532 6.3410 6.8284 1.9100 2.7882 2.0328 2.0582 6.5298 2.7117 8.2514 1.9409 1.8479 8.0225 1.3578 1.7537 1.4040 1.6589 1.4005 1.6104 1.4365 2.2759 1.8653 1.3100 5.6763 1.3517 2.1184 1.9206 2.1477 1.3938 2.9502 2.8556 2.5802 1.5083 7.7023 2.0988 1.6184 2.4757 1.4327 1.1165 1.7946 1.9904 2.8482 4.2450 3.7616 1.9990 1.3841 1.8151 1.2176 1.5366 9.3727 1.5845 1.3398 1.6248 4.3306 1.4564 1.5216 1.6378 6.6385 4.9552 1.2667 1.0782 1.0799 1.0912 1.0794 1.0795 1.0714 2.5650 1.1256 2.4897 2.7384 2.6869 10.1059 7.4496 7.2061 7.8061 8.5635 12.7482 13.0611 12.9294 12.9890 1.0617 1.0623 1.0622 1.0610 1.0483 1.0652 1.0990 1.1039 1.1047 1.0957 1.1041 1.0963 1.1007 1.0868 1.0903 1.0950 1.0885 1.0987 1.0918 1.0960 1.0990
irintensity: 9.3933 6.5598 1.9287 0.9207 5.0098 1.3348 10.9806 4.7583 0.3048 2.4237 8.7101 0.0652 7.3310 0.1511 1.8419 9.4071 1.5046 0.2151 2.4091 0.6860 6.3064 6.9800 17.8363 0.0708 3.3412 3.0610 8.8072 14.1598 5.0565 1.2768 5.1606 2.9583 0.2425 8.4860 0.2964 0.0105 0.0577 0.7542 16.7559 30.6996 6.3140 9.9857 10.8783 70.0496 10.7415 1.4889 0.3352 6.4224 1.9384 18.8432 26.4575 180.4996 159.8249 3.0146 1.8093 1.7808 2.9556 20.1691 0.7027 0.1444 4.1930 20.4378 4.1451 14.5846 74.3042 0.0118 3.4406 1.0745 0.3086 1.7617 9.0606 0.6398 15.8625 4.1451 0.0348 185.5493 0.0018 10.3602 35.3975 64.0193 0.4707 1.6063 455.5804 57.3187 3.1670 169.4388 77.8101 0.1332 71.9467 4.6847 13.6230 2.8910 3.1824 128.7510 236.0495 418.9162 1.0123 19.6408 51.2749 0.3469 3.5009 502.4900 0.2316 0.2406 20.5913 71.5023 0.3380 0.2497 3.0096 187.7484 173.7377 6.3769 1.6615 2.4897 10.2681 17.9130 13.9029 5.5030 2.4631 6.0945 4.3268 1.0456 22.9310 1626.6237 4.3992 27.0168 13.0808 557.9323 108.3567 1298.3277 496.0459 357.8979 50.1032 38.8210 36.0973 54.9472 52.4507 38.6091 50.0489 45.5169 95.3098 38.6432 33.8748 53.2959 26.6353 0.1243 4.6211 26.4614 0.9362 24.9561 2.9493 2.5741 8.2618
temp: 298.150 k
press: 1.00000 atm
elementType: 6 1 6 1 6 1 6 1 6 6 7 6 6 8 8 8 6 8 6 1 1 1 6 6 6 6 1 1 6 1 1 6 1 1 1 1 1 1 6 1 6 1 6 1 6 1 6 6 7 6 6 8 8
symmnumber: 1
zpe: 1095930.1 jmol-1
zpe.correction: 0.417418 hartree
zpe.thermalcorrener: 0.444534 hartree
zpe.thermalcorrenthalpy: 0.445478 hartree
zpe.thermalcorrgfe: 0.357504 hartree
zpe.sumelectzpe: -1487.392231 hartree
zpe.sumelectthermal: -1487.365115 hartree
zpe.sumelectthermalent: -1487.364171 hartree
zpe.sumelectthermalfe: -1487.452145 hartree
dipole: 1.4191 4.7362 0.5995
dipole: 4.9804
quadrupole: -230.6014 -174.9399 -212.0244
quadrupole: 38.9259 -3.6684 3.9196
quadrupole: -24.7462 30.9153 -6.1692 38.9259 -3.6684 3.9196
hfenergy: -1487.8096492 hartree
pointgroup: C01 [X(C24H21N2O6)]
dipole: 1.6176387 -0.8655488 0.6880981 debye
polarizability: 421.0785531|40.9737344|421.1790641|25.151968|-30.6317981|350.620495 unknown
InChI: InChI=1/24C.2N.6O.21H
charge -1 multiplicity 1
53 atoms
C  2.41633273 1.74111265 7.27792994
H  1.92579458 0.87921639 7.71702113
C  2.04443047 2.22578413 6.02068507
H  1.24919163 1.73079879 5.4733489
C  2.67498519 3.33648869 5.45673017
H  2.35940203 3.6885095 4.48029145
C  3.70327457 4.0031395 6.12804179
H  4.19579856 4.86499725 5.69151317
C  4.062735 3.51922028 7.37314856
C  3.43053978 2.41071423 7.93889657
N  5.12298533 3.03465992 9.34735459
C  5.08611478 4.01281849 8.32447624
C  4.01812911 2.15891115 9.2794374
O  5.77611427 5.0036873 8.3065818
O  3.67714451 1.40389497 10.15913648
O  5.60571887 3.41056112 10.57508726
C  6.91338613 3.10337742 10.95552371
O  7.23348296 3.68621478 11.95847045
C  9.110111 2.02879654 11.0185609
H  9.59969683 3.00608447 11.01136007
H  8.9446725 1.73422515 12.05772777
H  9.79637742 1.30863679 10.57182287
C  7.78701972 2.07039263 10.2347871
C  7.08227757 0.68870889 10.31014029
C  8.07496689 2.44597274 8.75625529
C  7.86436679 -0.3994381 9.5688636
H  6.0896143 0.75193245 9.85845108
H  6.94039007 0.41414083 11.36150498
C  8.84960043 1.34514805 8.02342089
H  7.14055359 2.58686356 8.21257491
H  8.62181373 3.39429551 8.72315203
C  8.11845905 0.00499836 8.11680995
H  7.28668967 -1.32924508 9.6053785
H  8.81553907 -0.60194405 10.07487089
H  8.9570128 1.63883893 6.97394239
H  9.86461135 1.24615698 8.42494681
H  8.68261276 -0.7737426 7.59172024
H  7.15078331 0.09672655 7.60654442
C  7.50568581 -2.29432305 5.0600897
H  6.94406097 -3.19276481 5.29760313
C  8.87597422 -2.35302281 4.77772399
H  9.38664839 -3.31127354 4.79023062
C  9.59991359 -1.19551106 4.4831832
H  10.66236202 -1.27102405 4.27198227
C  8.97607899 0.05777003 4.45957917
H  9.53828543 0.95989703 4.23785575
C  7.6219845 0.09992276 4.73976021
C  6.90333843 -1.04921611 5.03440122
N  5.41275701 0.76818624 5.22058185
C  6.64373038 1.24599814 4.86092688
C  5.49414083 -0.59170949 5.33691875
O  6.94095982 2.42647461 4.65837054
O  4.5750306 -1.35483571 5.64772899
