program: Gaussian 16
title: AWUYEX
version: ES64L-G16RevC.01
frameworkgroup: C1[X(C24H21N2O6)]
method: RwB97XD
basis: Gen
operation: Freq
keyword: #P
keyword: Geom=AllCheck
keyword: Guess=TCheck
keyword: SCRF=Check
keyword: GenChk
keyword: RwB97XD/ChkBas
keyword: Freq
converged: YES YES YES YES
title: Mulliken charges:
elementType: C H C H C H C H C C N C C O O O C O C H H H C C C C H H C H H C H H H H H H C H C H C H C H C C N C C O O
charge: -0.137150 0.195084 -0.130693 0.186344 -0.127162 0.186088 -0.136621 0.197509 -0.013204 -0.009929 -0.573809 0.623138 0.617004 -0.550255 -0.554535 -0.126744 0.688686 -0.531765 -0.370322 0.147996 0.157269 0.150670 -0.095587 -0.214965 -0.201080 -0.234792 0.146079 0.159268 -0.241017 0.136238 0.136577 -0.229160 0.131557 0.121762 0.126891 0.121630 0.122192 0.116965 -0.174079 0.166724 -0.155434 0.160057 -0.125136 0.141194 -0.161665 0.164106 -0.019554 -0.005217 -0.761470 0.587300 0.580536 -0.693825 -0.693695
chargesum: -1.00000
title: Mulliken charges with hydrogens summed into heavy atoms:
elementType: C C C C C C N C C O O O C O C C C C C C C C C C C C C N C C O O
charge: 0.057934 0.055651 0.058926 0.060888 -0.013204 -0.009929 -0.573809 0.623138 0.617004 -0.550255 -0.554535 -0.126744 0.688686 -0.531765 0.085612 -0.095587 0.090381 0.071736 0.018527 0.007504 0.009998 -0.007355 0.004623 0.016058 0.002440 -0.019554 -0.005217 -0.761470 0.587300 0.580536 -0.693825 -0.693695
polarizability: 5.02230168e+02 -1.94776222e+01 2.49916223e+02 2.86484125e+00 -1.79099310e+01 4.48132229e+02
1716.lowfreq: -8.1591 0.0008 0.0009 0.0011 2.2095 7.9228 16.7478 23.6076 30.5292
frequency: 16.0673 23.5013 30.3319 44.1102 51.4418 56.1797 57.5654 72.8233 75.1600 89.5977 128.4982 137.0652 140.2139 153.0664 184.9794 189.3867 202.6098 214.1316 223.3930 248.8516 250.8295 253.8922 258.3281 300.8799 320.8120 333.7514 343.8741 361.1764 366.2885 378.1006 405.8310 413.8372 423.6945 450.1122 467.3757 469.3066 476.9469 524.0150 532.7329 548.1843 565.7524 566.0584 600.5286 658.9080 664.8799 680.5238 694.0205 695.1257 700.1695 725.2563 735.1868 736.6829 757.4257 762.7984 768.0798 802.2049 806.9092 812.4714 812.9816 816.7857 840.0003 853.6169 863.2888 886.4070 899.5493 916.4451 924.0218 927.1225 960.7043 986.1360 998.1636 1002.9012 1011.3450 1017.6343 1024.8907 1035.1552 1045.7562 1049.2236 1055.2879 1062.4965 1091.7032 1102.0904 1107.0666 1109.7335 1134.5757 1147.9693 1164.9947 1171.3041 1187.7775 1190.5169 1193.1310 1200.3448 1201.3068 1225.5912 1238.2546 1247.2592 1261.8564 1302.1028 1318.4955 1321.1968 1324.5839 1329.0338 1336.3600 1367.6971 1383.1617 1387.8459 1403.3442 1405.0013 1409.2172 1412.6914 1418.9463 1428.6180 1482.9578 1486.7907 1490.7774 1498.5909 1505.7613 1511.4353 1512.6841 1513.4937 1517.6026 1519.2785 1520.6139 1676.0459 1690.2806 1691.1977 1694.7059 1698.8459 1794.0683 1830.2152 1852.8088 1892.4998 3049.9620 3062.2276 3065.4141 3073.0819 3076.0477 3081.8130 3108.0613 3111.2347 3115.3334 3130.8484 3162.1430 3179.6524 3192.4350 3217.9650 3222.7073 3232.0671 3234.2444 3243.2173 3250.8449 3252.4151 3255.5757
redmass: 7.6889 6.8650 6.7457 7.1114 10.4413 5.9043 6.4210 5.0977 4.6398 5.6807 6.8056 3.8698 4.1401 4.7315 7.6802 6.3036 3.8459 5.6018 2.0647 6.5275 5.9973 2.8287 7.2474 1.5024 8.7889 2.2653 6.4494 10.0075 6.5656 2.2274 1.9076 3.2097 3.0363 5.4874 4.7817 3.0955 4.9438 1.8090 7.3528 7.2090 9.1457 6.7534 9.4651 3.6304 14.1018 5.0961 4.9159 5.5520 8.0310 7.1283 2.7302 2.2950 5.9173 6.3799 6.6898 5.4452 1.5299 3.3040 2.9392 1.8146 3.2140 8.1426 1.6086 2.1288 8.0223 1.3557 1.3736 1.7394 1.6419 1.4019 1.6039 1.3870 1.7217 2.4477 1.3321 4.9561 1.3266 2.1336 2.1649 2.2386 2.4663 2.7854 1.6088 2.4504 1.3476 8.4291 2.0309 1.6867 1.1228 1.5506 1.7582 2.3756 2.0374 2.9876 4.2008 3.7386 1.9600 1.3424 1.7639 1.2741 1.5582 8.8894 1.3793 1.3506 4.8426 1.7107 1.5099 1.4879 5.5110 1.5428 3.5675 1.4970 1.0863 1.0724 1.0902 1.0958 1.0663 2.0030 1.2546 1.1679 2.2651 2.7027 2.6768 9.9087 7.3409 7.3514 7.8589 8.7065 12.7648 13.0300 13.0874 12.9936 1.0647 1.0633 1.0626 1.0687 1.0619 1.0435 1.0969 1.1020 1.1039 1.1045 1.1003 1.0930 1.1009 1.0881 1.0911 1.0954 1.0884 1.0917 1.0960 1.0944 1.0989
irintensity: 15.3508 2.1089 3.4450 0.2886 2.4053 1.8334 12.8375 2.5812 0.3955 4.3985 9.1434 1.7570 1.4525 0.1152 0.9584 8.1379 3.0033 1.1064 1.2122 2.8600 0.7016 7.5732 19.8480 1.6993 3.4986 1.1520 3.3474 14.0975 16.6117 1.3693 1.3623 1.8728 0.5554 4.6319 0.2824 0.4273 0.0304 7.7228 16.7181 32.2771 7.6403 8.3198 9.1857 41.6726 2.9540 3.3389 1.6134 21.0506 1.7345 8.9762 302.4487 80.2722 12.4400 0.6474 1.6312 3.3648 2.2080 3.0814 3.3548 15.9670 2.4030 17.6464 3.4763 7.1398 68.8015 0.0953 2.0287 8.7180 2.7397 0.8479 10.1357 0.3703 2.4918 6.2532 1.7724 98.6719 0.0323 14.2481 171.1970 166.5090 329.5098 4.4129 13.0463 51.2873 2.8305 164.6465 70.8618 11.7924 21.1255 0.4597 3.3929 41.4577 8.6859 159.7500 259.4000 396.4278 11.9662 17.0428 43.9882 4.4650 3.6271 514.1536 5.9631 3.5041 95.9407 13.2002 0.3413 1.8618 148.4678 11.9222 150.9442 32.6685 2.8455 12.4983 6.0304 3.9049 15.5451 3.3162 1.3700 12.4793 4.6471 1.1582 24.1403 1574.6815 10.9562 15.2329 14.8270 634.1490 101.6614 1283.9735 470.8665 368.6301 58.2755 47.9920 49.3320 19.2144 52.1432 17.2222 71.7955 66.8545 119.7868 64.0134 28.9844 39.6710 18.3155 5.7119 5.2822 19.6907 0.6781 2.3500 2.1871 8.2881 8.0292
temp: 298.150 k
press: 1.00000 atm
elementType: 6 1 6 1 6 1 6 1 6 6 7 6 6 8 8 8 6 8 6 1 1 1 6 6 6 6 1 1 6 1 1 6 1 1 1 1 1 1 6 1 6 1 6 1 6 1 6 6 7 6 6 8 8
symmnumber: 1
zpe: 1095561.4 jmol-1
zpe.correction: 0.417277 hartree
zpe.thermalcorrener: 0.444435 hartree
zpe.thermalcorrenthalpy: 0.445379 hartree
zpe.thermalcorrgfe: 0.357897 hartree
zpe.sumelectzpe: -1487.400084 hartree
zpe.sumelectthermal: -1487.372927 hartree
zpe.sumelectthermalent: -1487.371982 hartree
zpe.sumelectthermalfe: -1487.459464 hartree
dipole: -15.9517 -1.2363 6.4308
dipole: 17.2436
quadrupole: -315.7656 -202.5256 -208.8403
quadrupole: -61.4892 13.7109 13.3104
quadrupole: -73.3884 39.8516 33.5369 -61.4892 13.7109 13.3104
hfenergy: -1487.8173613 hartree
pointgroup: C01 [X(C24H21N2O6)]
dipole: 1.4352255 -1.263237 6.5091368 debye
polarizability: 358.7456461|87.9421124|384.3857702|80.9834257|-38.1691669|457.1472042 unknown
InChI: InChI=1/24C.2N.6O.21H
charge -1 multiplicity 1
53 atoms
C  2.68852274 1.56609515 6.36597553
H  2.15896731 0.65279473 6.61307393
C  2.52119041 2.18832124 5.12532507
H  1.84612302 1.75123309 4.39732038
C  3.20893101 3.35900915 4.80244174
H  3.0584416 3.81285558 3.8287945
C  4.08832146 3.95535367 5.71085445
H  4.62416182 4.86476212 5.46229147
C  4.23638387 3.34200801 6.94171654
C  3.55140173 2.16812005 7.26324363
N  4.92986735 2.6690529 9.02274458
C  5.0466708 3.74832492 8.11293204
C  3.90055521 1.77581443 8.65187899
O  5.68680638 4.7498279 8.32655835
O  3.44361723 0.91274082 9.36367297
O  5.12805155 2.93867278 10.35472449
C  6.35360484 2.66106734 10.95899383
O  6.44012038 3.1544233 12.05294332
C  6.76267189 0.33719787 10.22970142
H  6.41730442 0.00083298 11.21258846
H  5.91480575 0.31542987 9.5442014
H  7.49886095 -0.38493788 9.86999267
C  7.40030114 1.73773812 10.32802917
C  7.89602971 2.25619367 8.95208523
C  8.59458638 1.71136872 11.31446508
C  9.12761733 1.50374718 8.43655248
H  8.14365812 3.32045615 9.0482731
H  7.10557941 2.16985775 8.20708088
C  9.80381882 0.94025789 10.78261159
H  8.90270734 2.74406165 11.51366373
H  8.26671646 1.28823438 12.26885984
C  10.27400329 1.50788826 9.44468346
H  9.44123815 1.96558321 7.49406358
H  8.85784629 0.4670576 8.19955284
H  10.60669695 0.99446022 11.52577085
H  9.55962971 -0.12288185 10.66543583
H  11.12192196 0.93180334 9.05864422
H  10.62509176 2.53840535 9.5922009
C  4.58030443 -1.06163036 5.05397254
H  3.8127516 -1.79038653 4.81179786
C  5.27566236 -1.12088392 6.26717997
H  5.05132893 -1.90946085 6.9792857
C  6.26090402 -0.18049978 6.57612238
H  6.79167222 -0.25728009 7.51880303
C  6.57848441 0.85305017 5.68683122
H  7.34418217 1.58437517 5.92926102
C  5.88145709 0.90025073 4.49280625
C  4.9074264 -0.03761117 4.18262698
N  5.02238154 1.46906371 2.37353765
C  5.93841272 1.84784028 3.31669306
C  4.37270923 0.35284255 2.82377165
O  6.70916617 2.80829208 3.24151387
O  3.48172989 -0.26168534 2.23071413
