program: Gaussian 09
title: 000050194
version: EM64L-G09RevD.01
frameworkgroup: C1[X(C13H13N5O5S2)]
method: RPBEPBE
basis: SDD
operation: Freq
keyword: #p
keyword: freq=noraman
keyword: PBEPBE/SDD
title: #p freq=noraman PBEPBE/SDD
converged: YES YES NO NO
title: Mulliken charges:
elementType: S S O O O O O N N N N N C C C C C C C C C C C C C H H H H H H H H H H H H H
charge: 0.204491 0.237914 -0.146523 -0.404321 -0.293663 -0.235519 -0.201443 -0.155585 -0.368167 -0.061373 -0.002695 -0.566358 -0.494174 -0.174173 0.108482 0.277937 -0.704114 -0.199537 0.229582 0.143622 -0.048909 0.342347 -0.668546 -0.209089 -0.495462 0.324042 0.304929 0.353167 0.271424 0.283582 0.269609 0.390832 0.327008 0.337278 0.329451 0.230681 0.233299 0.229975
chargesum: 0.00000
title: Mulliken charges with hydrogens summed into heavy atoms:
elementType: S S O O O O O N N N N N C C C C C C C C C C C C C
charge: 0.204491 0.237914 -0.146523 -0.013489 -0.293663 -0.235519 -0.201443 -0.155585 -0.015000 -0.061373 -0.002695 0.100371 -0.170132 0.130756 0.108482 0.277937 -0.149107 0.070072 0.229582 0.143622 -0.048909 0.342347 -0.341538 -0.209089 0.198492
polarizability: 3.38236261e+02 -2.60292646e+01 2.31962999e+02 6.03455996e+00 -5.02128657e+00 1.66625704e+02
1716.lowfreq: -2.5921 0.0005 0.0009 0.0016 2.2131 5.3665 10.9664 14.8616 26.1317
frequency: 10.6985 14.6376 26.1019 27.8281 50.9967 61.4297 75.4295 86.4627 95.9357 105.4315 124.6360 126.6387 137.9815 161.6054 171.0472 204.3360 212.6707 218.2872 245.1183 252.4696 269.0850 279.5639 291.2366 291.8018 333.8847 361.7051 378.3869 405.7838 408.8784 418.1405 438.4204 462.6759 490.3432 518.3610 536.4486 543.3284 557.9323 574.5696 575.0002 610.4392 622.9695 642.1969 652.9196 663.5898 694.7956 720.9304 736.5523 738.7334 750.2140 766.7914 802.9204 805.1680 810.4770 816.5884 886.6038 888.6526 900.2951 929.0125 962.1965 970.4570 986.4504 1006.4292 1042.7436 1057.7193 1098.9851 1102.2588 1104.1712 1112.1090 1148.7559 1148.9487 1167.8965 1189.8044 1207.2815 1222.3759 1235.7167 1238.1617 1260.0216 1266.5712 1311.2959 1321.3929 1335.9591 1413.3233 1419.3300 1424.5674 1432.7525 1449.5632 1466.3580 1472.6494 1533.2231 1587.8381 1598.4066 1630.0724 1638.3920 1645.5203 1739.4143 2989.4561 3001.4336 3043.9731 3066.9943 3078.4056 3095.6568 3132.5623 3139.2490 3256.7685 3471.0378 3532.0640 3560.6297 3712.0690
redmass: 5.3997 8.1928 8.5696 7.6386 11.6169 8.8315 7.0387 2.3166 6.7524 5.4497 4.5511 2.6986 4.8746 6.5331 3.3362 3.4823 4.1794 4.3957 5.9428 7.8647 8.5543 8.2962 3.3364 1.4442 5.2470 5.1930 5.8057 8.5701 9.2407 1.2395 5.7679 5.3838 6.3871 4.9190 4.7572 3.7851 5.6666 5.8067 6.0820 2.0358 4.4496 4.9256 4.3768 7.0153 4.0297 6.1276 1.5540 3.2572 3.3314 3.7961 3.7944 1.8634 2.6976 2.6301 4.9855 2.0167 6.4971 3.3936 3.9462 4.6619 5.2469 6.8440 2.6771 4.0580 1.7813 1.8443 1.2509 2.0951 1.2253 1.4285 1.4491 2.0918 1.9196 1.8306 1.6869 1.3398 3.5830 1.5018 2.0253 2.1169 3.5544 1.2528 4.3921 1.0981 5.4100 1.0529 1.1004 2.0783 9.7965 1.5430 8.5356 8.5143 3.0363 8.6850 12.8199 1.0289 1.0610 1.0833 1.1000 1.0895 1.1057 1.1032 1.0903 1.0958 1.0775 1.0644 1.0451 1.1047
irintensity: 0.1204 0.3403 1.1421 1.5515 5.3136 1.8260 0.5465 2.2110 1.5046 1.6466 1.9194 0.1766 1.0668 2.5518 0.2947 5.1546 3.0660 1.2275 3.1679 2.4125 6.2718 17.2251 12.9752 73.8079 11.1024 13.8456 20.8868 12.2153 5.8098 251.2305 16.5241 18.2237 0.2585 3.6462 5.5062 39.3063 9.9248 11.6712 13.2688 100.5623 11.9967 15.1828 38.1577 0.3870 27.8446 55.4712 34.4249 34.6227 2.9674 19.6795 29.9661 67.2736 52.5715 35.9387 56.5499 30.4091 0.3487 53.7338 49.8921 56.8583 78.0615 138.8862 8.9000 234.9611 18.1987 68.1354 0.1679 95.4503 5.1210 6.1673 11.6903 24.9589 9.9824 23.3224 54.9204 20.1148 78.8394 75.8923 90.7962 10.2793 113.1562 4.3494 122.1092 16.6335 14.7209 14.0372 117.5112 702.2027 3.5935 13.2429 151.2478 279.2113 474.5412 50.0914 426.9462 77.1798 20.1961 43.0487 2.9110 13.9302 34.4033 16.3968 0.5531 41.8238 57.2720 53.6489 115.5318 49.1652
temp: 298.150 k
press: 1.00000 atm
elementType: 16 16 8 8 8 8 8 7 7 7 7 7 6 6 6 6 6 6 6 6 6 6 6 6 6 1 1 1 1 1 1 1 1 1 1 1 1 1
symmnumber: 1
zpe: 687939.8 jmol-1
zpe.correction: 0.262022 hartree
zpe.thermalcorrener: 0.286998 hartree
zpe.thermalcorrenthalpy: 0.287942 hartree
zpe.thermalcorrgfe: 0.203147 hartree
zpe.sumelectzpe: -1947.279962 hartree
zpe.sumelectthermal: -1947.254987 hartree
zpe.sumelectthermalent: -1947.254042 hartree
zpe.sumelectthermalfe: -1947.338837 hartree
dipole: 2.3937 3.0216 2.0840
dipole: 4.3821
quadrupole: -120.5613 -147.0704 -159.3559
quadrupole: 12.0960 -15.6909 -2.0138
quadrupole: 21.7679 -4.7412 -17.0267 12.0960 -15.6909 -2.0138
hfenergy: -1947.541984 hartree
pointgroup: C01 [X(C13H13N5O5S2)]
dipole: 1.0282994 0.4194675 -1.3187112 debye
polarizability: 328.1810492|30.1293032|184.8604185|29.0026033|31.6223784|223.7834958 unknown
InChI: InChI=1S/C13H13N5O5S2/c1-23-17-7(5-4-25-13(14)15-5)9(19)16-8-10(20)18-6(12(21)22)2-3-24-11(8)18/h2,4,8,11,16,21H,3,14H2,1H3
charge 0 multiplicity 1
38 atoms
S  -1.930503 1.058614 -1.857786
S  5.727418 2.035733 2.114573
O  -2.218123 -1.762664 1.65564
O  -5.215459 -1.131072 1.823375
O  1.214694 1.607404 1.888523
O  -6.463102 -1.555444 -0.096231
O  3.382398 -1.281328 -1.274765
N  -3.228918 0.104147 0.425713
N  0.090434 0.193049 0.428858
N  2.271467 -0.69446 -0.603919
N  5.045183 0.257657 0.213947
N  7.409993 0.564316 0.397219
C  -2.298239 1.172311 0.000501
C  -1.203619 0.536667 0.944402
C  -2.234417 -0.634077 1.149964
C  -4.433603 -0.206205 -0.235114
C  -3.776155 1.115642 -2.338234
C  -4.695821 0.275189 -1.491527
C  1.249321 0.741372 0.959826
C  -5.467681 -1.032688 0.457701
C  2.53965 0.213588 0.333882
C  3.840386 0.71921 0.797792
C  3.999927 1.66171 1.818107
C  6.106637 0.815057 0.755342
C  2.854727 -2.259824 -2.253678
H  -2.642155 2.190233 0.236518
H  -1.054659 1.145316 1.853919
H  0.217347 -0.505989 -0.312494
H  -3.803332 0.770579 -3.38703
H  -4.092594 2.175576 -2.331817
H  -5.676376 0.026053 -1.91542
H  -5.889811 -1.727571 2.246322
H  3.214524 2.14161 2.394785
H  7.580229 -0.109854 -0.345587
H  8.191733 1.021126 0.855669
H  2.212733 -1.755547 -2.996601
H  2.2895 -3.05548 -1.738312
H  3.754564 -2.672856 -2.734963
