program: Gaussian 16
title: AWUYEX
version: ES64L-G16RevC.01
frameworkgroup: C1[X(C24H21N2O6)]
method: RwB97XD
basis: Gen
operation: Freq
keyword: #P
keyword: Geom=AllCheck
keyword: Guess=TCheck
keyword: SCRF=Check
keyword: GenChk
keyword: RwB97XD/ChkBas
keyword: Freq
converged: YES YES NO YES
title: Mulliken charges:
elementType: C H C H C H C H C C N C C O O O C O C H H H C C C C H H C H H C H H H H H H C H C H C H C H C C N C C O O
charge: -0.141704 0.196154 -0.127268 0.183278 -0.128093 0.183461 -0.141628 0.196288 0.001722 0.002383 -0.568235 0.606578 0.605727 -0.566577 -0.565235 -0.113865 0.690315 -0.520544 -0.355413 0.144509 0.144600 0.136751 -0.101380 -0.217151 -0.217171 -0.239214 0.155894 0.139371 -0.239571 0.157524 0.139655 -0.232568 0.130393 0.125699 0.130380 0.125729 0.124488 0.124515 -0.168969 0.167594 -0.147235 0.164550 -0.146653 0.164427 -0.168531 0.167611 -0.008965 -0.009214 -0.765268 0.585524 0.586076 -0.695395 -0.695349
chargesum: -1.00000
title: Mulliken charges with hydrogens summed into heavy atoms:
elementType: C C C C C C N C C O O O C O C C C C C C C C C C C C C N C C O O
charge: 0.054450 0.056010 0.055369 0.054660 0.001722 0.002383 -0.568235 0.606578 0.605727 -0.566577 -0.565235 -0.113865 0.690315 -0.520544 0.070447 -0.101380 0.078115 0.080008 0.016878 0.016538 0.016434 -0.001375 0.017315 0.017774 -0.000921 -0.008965 -0.009214 -0.765268 0.585524 0.586076 -0.695395 -0.695349
polarizability: 3.90650342e+02 -1.17106119e+02 3.54821967e+02 -3.75885504e+00 -3.98868408e+00 4.49432743e+02
1716.lowfreq: -9.7593 -5.3204 -0.0005 -0.0004 0.0007 5.8070 11.0449 20.3595 25.6023
frequency: 10.1157 19.0968 25.4379 27.4050 36.0259 47.4006 62.1169 69.5452 85.9795 91.3340 99.3422 141.6125 150.6332 154.1295 183.4724 185.7753 191.4828 206.4562 217.5069 247.6624 249.4842 250.8736 261.0281 283.7846 321.7807 326.8231 359.6129 361.2093 379.1260 383.8023 392.2469 408.8855 420.5094 437.0339 468.9701 475.5408 477.1593 522.0480 532.7611 546.9144 565.5957 570.7104 604.3603 664.6546 668.1981 681.3854 694.3066 697.7363 699.6956 722.3013 727.3558 729.5879 740.4821 761.9972 769.5594 799.5301 807.0315 810.0614 813.0076 817.3963 838.5280 853.3135 856.9270 875.2585 899.6349 918.7835 919.0772 921.5600 959.2831 990.0847 1000.3068 1000.6819 1002.6088 1007.7062 1031.0716 1037.5279 1040.6155 1046.3316 1054.7400 1063.2316 1097.6815 1102.5883 1107.3950 1109.4644 1126.5004 1148.0337 1164.7760 1167.9308 1178.2753 1187.3654 1187.4058 1192.3133 1201.7292 1227.5702 1242.1183 1245.1006 1248.8964 1296.2508 1315.9088 1316.9960 1325.0275 1328.3850 1333.3809 1362.6415 1382.4094 1390.0688 1395.6366 1401.4456 1403.2226 1409.3455 1422.0981 1428.9557 1478.6578 1479.7899 1488.5533 1492.1543 1500.1727 1510.6103 1511.2053 1513.0205 1516.8821 1520.2899 1521.3290 1676.1539 1690.4820 1692.9935 1694.6508 1698.5856 1794.1647 1832.7709 1848.5564 1894.7218 3044.7447 3071.2161 3071.4853 3086.9058 3089.7353 3093.3178 3108.4482 3117.3464 3119.7833 3167.5567 3180.4932 3185.2870 3187.5298 3218.0178 3225.2064 3232.5020 3233.9257 3241.0142 3242.6758 3250.3149 3255.0720
redmass: 5.1973 5.8027 7.3585 6.7879 6.7221 6.7616 6.9410 5.3988 6.3052 6.7004 4.0729 4.7059 5.9713 5.5513 3.4877 7.6609 8.0733 1.4172 8.7259 6.8761 4.7190 5.2753 7.7034 1.3439 13.1008 2.5481 7.5522 11.0090 2.9728 2.1383 2.5061 3.1805 3.0032 4.6825 4.6499 4.9894 3.1311 1.8582 7.3572 7.2120 9.2513 6.6952 8.1301 13.9951 4.3259 5.0158 4.8015 4.7372 8.0412 7.2752 7.5567 2.6616 2.3855 6.3185 6.7756 3.2685 1.8493 1.8471 6.6848 1.9673 2.5790 8.2776 1.9480 1.9401 7.9439 1.3719 1.7243 1.3819 1.6725 1.4003 1.6063 1.4115 2.1136 1.9583 1.3063 5.2463 1.3437 2.1138 1.9316 2.1863 1.4304 2.9579 2.9100 2.5930 1.4098 7.8960 2.0961 1.6464 2.5597 1.1291 1.4336 1.7634 1.9921 2.8108 4.3024 3.7461 1.9701 1.3933 1.2089 1.8214 1.5535 9.3436 1.5552 1.3505 1.4352 3.9897 1.7046 1.5393 1.6509 6.7049 5.3389 1.2661 1.0829 1.0748 1.0933 1.0774 1.0747 1.0693 2.5766 1.0918 2.7366 2.7836 2.7061 9.8123 7.5253 7.2589 7.8542 8.7910 12.7686 13.0360 12.9352 12.9804 1.0659 1.0631 1.0616 1.0430 1.0694 1.0670 1.0957 1.1040 1.1048 1.1041 1.0933 1.0922 1.1008 1.0868 1.0903 1.0950 1.0884 1.0986 1.0916 1.0959 1.0991
irintensity: 4.6567 4.1326 1.6540 1.3845 3.3152 5.7128 0.8508 3.2007 3.2670 8.7200 7.4379 0.1457 7.7932 0.2452 4.2903 7.8137 3.0030 0.0035 0.9347 0.8585 4.2721 3.2284 21.0151 0.0024 0.4459 2.9125 7.1679 16.8511 6.2369 0.5182 5.8379 1.3545 0.4936 8.6382 0.6071 0.0576 0.0241 0.7094 17.8032 34.1670 8.8027 5.3962 12.8255 5.0469 78.5175 0.1192 0.0870 4.4909 1.2296 18.8263 0.2291 280.7228 134.4483 0.1413 1.2888 5.8827 0.4877 15.2838 0.2559 12.6260 4.0161 18.6382 3.1691 15.3122 66.9831 0.5911 2.4827 0.0927 0.1580 0.7020 9.2398 0.6454 11.0218 7.0427 0.0376 145.9570 0.1446 13.6668 32.2598 68.3011 0.7612 0.5069 482.4012 58.2207 0.2708 155.5381 81.1667 0.7635 77.5136 13.8860 3.9259 4.2230 2.3744 151.5107 246.3036 407.8563 0.0030 25.2026 0.0568 52.6002 1.8753 496.8822 0.0063 0.1217 1.5068 55.1997 1.5277 0.4154 2.0340 175.0288 189.5769 7.5547 0.9157 2.9146 5.2737 16.5209 19.0285 1.3576 4.0094 9.4991 2.6058 2.0401 22.8669 1515.6925 4.6033 24.9614 14.5144 669.4998 96.4414 1232.3539 506.2799 323.6225 58.0802 37.7300 38.2572 21.0592 96.4215 31.2736 75.1888 40.5089 98.0329 32.7405 36.8709 57.2208 26.6724 0.1745 1.7740 21.3900 0.6044 20.6868 2.3860 2.6549 8.0404
temp: 298.150 k
press: 1.00000 atm
elementType: 6 1 6 1 6 1 6 1 6 6 7 6 6 8 8 8 6 8 6 1 1 1 6 6 6 6 1 1 6 1 1 6 1 1 1 1 1 1 6 1 6 1 6 1 6 1 6 6 7 6 6 8 8
symmnumber: 1
zpe: 1094580.6 jmol-1
zpe.correction: 0.416904 hartree
zpe.thermalcorrener: 0.444266 hartree
zpe.thermalcorrenthalpy: 0.445210 hartree
zpe.thermalcorrgfe: 0.355839 hartree
zpe.sumelectzpe: -1487.398585 hartree
zpe.sumelectthermal: -1487.371223 hartree
zpe.sumelectthermalent: -1487.370278 hartree
zpe.sumelectthermalfe: -1487.459649 hartree
dipole: 23.9138 4.4033 -0.0152
dipole: 24.3158
quadrupole: -317.3022 -189.0750 -212.9306
quadrupole: 27.9480 1.1312 0.7836
quadrupole: -77.5329 50.6942 26.8387 27.9480 1.1312 0.7836
hfenergy: -1487.8154886 hartree
pointgroup: C01 [X(C24H21N2O6)]
dipole: 8.2377196 -3.1755548 3.6844642 debye
polarizability: 340.1650791|93.8254794|382.9169087|49.0824209|-17.3870475|471.8230644 unknown
InChI: InChI=1/24C.2N.6O.21H
charge -1 multiplicity 1
53 atoms
C  2.60185274 0.94782809 6.35981382
H  2.08390694 0.11664701 6.8255968
C  2.50810619 1.18446742 4.98626146
H  1.90672629 0.52378636 4.37085821
C  3.16702461 2.26276864 4.39082838
H  3.06702193 2.42226903 3.32242532
C  3.94472111 3.14312286 5.14694763
H  4.45069432 3.98522053 4.68771355
C  4.03217065 2.90120841 6.50655462
C  3.37323449 1.82527303 7.10108815
N  4.6194462 2.85827612 8.71806531
C  4.74922946 3.6596189 7.56045885
C  3.63911569 1.8527412 8.56017023
O  5.34855165 4.70705161 7.51251012
O  3.18165565 1.18873044 9.4594761
O  4.77726509 3.44309 9.94688987
C  5.90847408 3.19732946 10.72567958
O  5.87487667 3.81038895 11.76090196
C  8.06014077 2.30071293 11.46952928
H  8.44017765 3.31438632 11.61910791
H  7.6061355 1.96181041 12.40402375
H  8.91115263 1.65270072 11.25698696
C  7.0468236 2.25498593 10.31293134
C  6.52022417 0.80570037 10.13726374
C  7.72668593 2.74142713 9.0055648
C  7.6094311 -0.15118911 9.64161416
H  5.71327225 0.78511407 9.4041176
H  6.10213963 0.45634809 11.08765577
C  8.80748797 1.77060964 8.51801716
H  6.98884584 2.82878475 8.20765629
H  8.14813798 3.73946816 9.16762111
C  8.2455463 0.35775525 8.34644864
H  7.15733766 -1.13540298 9.47914365
H  8.38265579 -0.2860659 10.40665788
H  9.19876146 2.13975293 7.5640331
H  9.65338998 1.75128479 9.21471096
H  9.03530736 -0.32653436 8.01832421
H  7.48345424 0.36968692 7.55440197
C  0.47298058 3.34743087 8.24994651
H  -0.03912053 2.50396939 8.7028855
C  1.30356182 4.17967484 9.00993711
H  1.43538274 3.98525934 10.06995097
C  1.96797587 5.2604642 8.42470421
H  2.6057619 5.88850892 9.03917806
C  1.82202442 5.5432755 7.0613389
H  2.34214088 6.37985402 6.60474719
C  0.99693551 4.71287454 6.32334007
C  0.3380571 3.63954408 6.90405078
N  -0.23620221 3.65124162 4.61776918
C  0.61359039 4.69553404 4.860993
C  -0.44078338 2.97680896 5.79052493
O  1.02013363 5.51464208 4.03240008
O  -1.14887942 1.9781434 5.94449065
