program: Gaussian 16
title: TScycbwfx
version: ES64L-G16RevC.01
frameworkgroup: C1[X(C27H19O)]
method: UwB97XD
basis: def2SVPP
operation: SP
keyword: #UwB97XD/Def2SVPP
keyword: SCRF=(PCM,solvent=TetraHydroFuran)
keyword: Integral=UltraFineGrid
keyword: POP=NONE
keyword: #SCF=Tight
keyword: geom=check
keyword: guess=read
keyword: output=wfx
title: #UwB97XD/Def2SVPP SCRF=(PCM,solvent=TetraHydroFuran) Integral=UltraFin
title: TScycb wfx
hfenergy: -1114.3880024 hartree
pointgroup: C01 [X(C27H19O1)]
InChI: InChI=1S/C27H19O/c1-2-10-20(11-3-1)19-28-27-17-9-8-16-25(27)26-18-21-12-4-5-13-22(21)23-14-6-7-15-24(23)26/h1-19H
charge -1 multiplicity 1
47 atoms
C  -2.759099 -0.321729 -0.51244
C  -4.109604 -0.653007 -0.702774
C  -5.117991 0.23048 -0.333559
C  -4.7952 1.46864 0.229646
C  -3.455254 1.793878 0.428541
C  -2.419773 0.918283 0.076091
H  -4.341334 -1.61924 -1.159373
H  -6.164354 -0.04888 -0.490885
H  -5.581908 2.169375 0.522537
H  -3.188211 2.747984 0.894363
O  -1.860055 -1.23217 -0.925185
C  -0.4980 -0.885256 -1.03204
C  0.390767 -1.999558 -1.032844
H  -0.32177 -0.096092 -1.777003
C  1.747249 -1.819056 -1.413031
C  2.67716 -2.837909 -1.256439
C  2.300317 -4.079379 -0.725545
C  0.958272 -4.287074 -0.384483
C  0.017721 -3.27357 -0.531736
H  2.058972 -0.852238 -1.822738
H  3.719624 -2.664288 -1.54649
H  3.037584 -4.878758 -0.601867
H  0.643299 -5.259145 0.012061
H  -1.024591 -3.445308 -0.252545
C  -0.993737 1.256754 0.288968
C  -0.484189 2.435624 -0.140276
C  -0.114568 0.183876 0.781376
H  -1.152023 3.194737 -0.562739
C  0.942113 2.67468 -0.208362
C  1.305764 0.484975 0.905994
C  1.440584 3.862676 -0.777039
C  1.840272 1.67578 0.264526
C  2.112859 -0.368336 1.684581
C  3.225463 1.927855 0.108986
C  -0.647873 -0.728928 1.779954
C  0.177992 -1.510011 2.545356
H  -1.732632 -0.810411 1.897438
H  -0.263442 -2.216554 3.258057
C  1.588292 -1.375007 2.476629
H  3.191938 -0.190738 1.724241
H  2.240983 -1.999715 3.092639
C  3.69739 3.101507 -0.458839
H  3.950723 1.175927 0.429676
H  4.776426 3.253045 -0.564822
C  2.803112 4.087919 -0.903958
H  0.725841 4.614322 -1.130083
H  3.174422 5.014285 -1.351943
