program: Gaussian 09
title: 000050106
version: EM64L-G09RevD.01
frameworkgroup: C1[X(C13H15N)]
method: RPBEPBE
basis: SDD
operation: Freq
keyword: #pfreq=noraman
keyword: PBEPBE/SDD
title: #p freq=noraman PBEPBE/SDD
converged: YES YES NO NO
title: Mulliken charges:
elementType: N C C C C C C C C C C C C C H H H H H H H H H H H H H H H
charge: -0.016979 0.433529 0.503303 -0.114440 -0.605148 -0.539952 0.159669 -0.375096 -0.325003 -0.336657 -0.492216 -0.339370 -0.675080 -0.677628 0.237504 0.211189 0.210726 0.235116 0.241535 0.259187 0.202892 0.232177 0.235643 0.223201 0.217999 0.224260 0.236572 0.218843 0.214223
chargesum: 0.00000
title: Mulliken charges with hydrogens summed into heavy atoms:
elementType: N C C C C C C C C C C C C C
charge: -0.016979 0.433529 0.503303 -0.114440 -0.367643 -0.118037 0.159669 -0.139979 -0.083468 -0.077469 -0.057148 -0.103727 -0.009620 -0.007990
polarizability: 2.38741609e+02 -1.07787838e+01 1.40442708e+02 1.02426125e+01 1.96435908e+00 8.24383870e+01
1716.lowfreq: -26.2487 -14.7212 -7.6342 -1.8185 0.0005 0.0006 0.0007 37.8747 53.8541
frequency: -19.3415 37.3408 53.8463 117.9023 172.2254 180.0110 208.3657 211.4077 261.7434 285.3058 332.4721 397.4734 420.3636 435.5870 446.7431 483.2958 528.7763 581.5278 607.1379 652.9163 712.9549 735.0998 769.5451 784.9368 801.8303 810.0418 828.7332 851.2067 903.0130 904.3893 936.5774 977.5770 977.7092 981.9601 982.4694 1052.8745 1056.1127 1065.7343 1069.4398 1119.8637 1145.2477 1179.5490 1220.5731 1239.1955 1241.5707 1259.1973 1267.6922 1301.7093 1311.6390 1317.1305 1361.7173 1382.4919 1388.5631 1397.6376 1406.5934 1463.6155 1471.5517 1472.4290 1472.8042 1475.3957 1487.6015 1490.7372 1496.0963 1552.0348 1594.0750 1632.7753 2979.5661 2979.9724 2982.3360 2996.4662 3035.6583 3059.5590 3078.3799 3079.7426 3084.0558 3090.6481 3107.7205 3120.2077 3121.3270 3150.1570 3161.6176
redmass: 2.5319 2.5677 3.6145 3.5864 4.1157 1.5980 2.4824 1.1536 1.6003 4.3280 2.1894 3.3735 4.1519 3.5971 3.1727 3.2748 6.5984 4.3838 2.7874 5.3473 3.1509 5.2991 1.5219 1.1899 2.7338 2.2244 1.4778 1.6531 3.5754 1.6254 3.5187 2.1021 1.3812 2.1214 1.3654 2.0026 1.9465 1.6963 1.6227 1.5903 1.2705 1.3874 1.7197 1.5502 1.4021 2.0820 1.7086 2.0280 1.5182 1.7475 3.0821 1.2492 1.2127 2.4668 6.3925 1.0823 1.1619 1.0487 1.0757 1.8690 1.1272 1.2648 3.3216 7.0167 6.6252 6.8228 1.0347 1.0379 1.0576 1.0620 1.1007 1.0993 1.1000 1.0997 1.1011 1.1018 1.0914 1.0890 1.0879 1.0977 1.0956
irintensity: 0.2423 0.3082 0.6296 0.1002 4.2635 0.5580 0.3710 0.0761 0.7724 0.5466 0.2399 0.7816 4.4337 2.3162 4.6524 4.6651 0.2009 1.9657 2.2336 0.8181 9.4766 0.1370 0.8928 6.1824 0.5401 0.9735 2.5968 59.3061 10.2657 25.5949 0.8412 6.4493 0.2890 3.4137 2.4981 16.9977 27.1937 8.7444 2.5613 8.3756 1.5169 5.0429 4.9733 1.0327 0.6590 1.2946 1.5255 10.2549 1.5127 1.8536 5.2987 8.4844 11.8708 4.7995 7.2090 5.6124 4.9609 14.9028 10.9116 2.1062 18.4243 1.5466 49.4243 16.7509 53.8544 2.3068 51.5890 36.2274 36.9173 34.1037 8.4838 2.0839 66.2278 54.6470 37.9324 36.8106 19.2371 16.1445 9.0658 24.5712 10.0953
temp: 298.150 k
press: 1.00000 atm
elementType: 7 6 6 6 6 6 6 6 6 6 6 6 6 6 1 1 1 1 1 1 1 1 1 1 1 1 1 1 1
symmnumber: 1
zpe: 638767.3 jmol-1
zpe.correction: 0.243294 hartree
zpe.thermalcorrener: 0.255491 hartree
zpe.thermalcorrenthalpy: 0.256436 hartree
zpe.thermalcorrgfe: 0.204506 hartree
zpe.sumelectzpe: -558.138780 hartree
zpe.sumelectthermal: -558.126582 hartree
zpe.sumelectthermalent: -558.125638 hartree
zpe.sumelectthermalfe: -558.177568 hartree
dipole: 0.9941 1.8191 0.2994
dipole: 2.0946
quadrupole: -71.4044 -78.4254 -87.8805
quadrupole: -3.9148 1.5965 -0.2068
quadrupole: 7.8324 0.8114 -8.6437 -3.9148 1.5965 -0.2068
hfenergy: -558.3820736 hartree
pointgroup: C01 [X(C13H15N1)]
dipole: 0.3860057 0.7061242 0.1774002 debye
polarizability: 239.1649487|-10.5531337|139.387044|7.3138141|7.3694326|83.070712 unknown
InChI: InChI=1S/C13H15N/c1-3-10-5-8-13-11(9-10)6-7-12(4-2)14-13/h5-9H,3-4H2,1-2H3
charge 0 multiplicity 1
29 atoms
N  -1.592864 -0.878011 -0.378974
C  0.189402 0.784984 0.137965
C  2.519217 -0.009077 0.334381
C  -0.260353 -0.56332 -0.141505
C  1.580541 1.028971 0.372747
C  4.003953 0.247028 0.547934
C  -2.505825 0.118433 -0.347022
C  2.057706 -1.343084 0.0566
C  -0.808106 1.814008 0.163022
C  0.709338 -1.616353 -0.174503
C  -3.958669 -0.264848 -0.56577
C  -2.141667 1.485167 -0.076864
C  4.813609 0.190928 -0.775388
C  -4.680286 -0.571179 0.774366
H  1.909322 2.054712 0.587046
H  4.149911 1.236743 1.020349
H  4.414759 -0.505167 1.250137
H  2.78946 -2.160519 0.034734
H  -0.51204 2.850138 0.366953
H  0.351485 -2.629901 -0.380901
H  -4.489819 0.551184 -1.092259
H  -3.987612 -1.16212 -1.208323
H  -2.922628 2.253038 -0.066923
H  4.705747 -0.793126 -1.266849
H  5.889106 0.36229 -0.585994
H  4.459553 0.960009 -1.485187
H  -4.173453 -1.39905 1.300917
H  -5.730441 -0.86477 0.594305
H  -4.68015 0.310292 1.442004
