program: Gaussian 16
title: AWUYEX
version: ES64L-G16RevC.01
frameworkgroup: C1[X(C24H21N2O6)]
method: RwB97XD
basis: Gen
operation: Freq
keyword: #P
keyword: Geom=AllCheck
keyword: Guess=TCheck
keyword: SCRF=Check
keyword: GenChk
keyword: RwB97XD/ChkBas
keyword: Freq
converged: YES YES NO YES
title: Mulliken charges:
elementType: C H C H C H C H C C N C C O O O C O C H H H C C C C H H C H H C H H H H H H C H C H C H C H C C N C C O O
charge: -0.143809 0.194519 -0.132151 0.177815 -0.129535 0.178459 -0.140384 0.195864 -0.011017 -0.012233 -0.521020 0.621691 0.616613 -0.557052 -0.549641 -0.143530 0.689382 -0.522876 -0.384382 0.172169 0.161451 0.144797 -0.092312 -0.204658 -0.218308 -0.242204 0.140633 0.135591 -0.237611 0.139230 0.158990 -0.227137 0.127421 0.122374 0.130350 0.123750 0.122297 0.117278 -0.171274 0.165297 -0.153889 0.158070 -0.154933 0.158015 -0.171185 0.164952 -0.007642 -0.016514 -0.723949 0.569524 0.560836 -0.697991 -0.680130
chargesum: -1.00000
title: Mulliken charges with hydrogens summed into heavy atoms:
elementType: C C C C C C N C C O O O C O C C C C C C C C C C C C C N C C O O
charge: 0.050710 0.045664 0.048924 0.055481 -0.011017 -0.012233 -0.521020 0.621691 0.616613 -0.557052 -0.549641 -0.143530 0.689382 -0.522876 0.094035 -0.092312 0.071566 0.079912 0.007591 0.016489 0.012438 -0.005977 0.004181 0.003083 -0.006233 -0.007642 -0.016514 -0.723949 0.569524 0.560836 -0.697991 -0.680130
polarizability: 3.83358129e+02 1.00734671e+02 3.85898798e+02 -6.88026007e+01 4.63090876e+01 4.16322913e+02
1716.lowfreq: -12.3190 -0.0008 0.0004 0.0010 0.5674 8.4978 20.3840 26.9176 29.5990
frequency: 14.7017 25.9192 29.3217 32.7690 37.9201 41.7029 44.7550 56.9029 90.9477 100.7671 126.2060 135.5958 142.0459 164.1583 181.9439 188.6869 194.2134 206.0780 217.7564 239.0099 251.0054 253.2917 255.3435 298.3578 322.3343 334.2001 352.0844 365.0101 367.3219 384.1508 398.2959 410.8662 419.3650 451.5792 469.9299 470.8590 474.0347 524.7898 531.8631 547.3102 567.9586 569.3599 601.8434 665.4184 666.3957 683.8669 693.6352 698.5344 700.5384 723.2557 728.3667 735.8451 747.2750 762.5929 775.0705 803.8738 804.9341 808.2939 810.8419 812.8292 839.6387 853.8450 860.3475 883.5639 899.7908 916.3807 924.0014 925.5199 959.0808 985.3671 997.9812 1002.6257 1013.5479 1019.0006 1025.1401 1032.0029 1038.6671 1048.0678 1056.6698 1063.7307 1090.2886 1102.7133 1105.0396 1108.6199 1133.6368 1158.6552 1166.4635 1170.2713 1185.8611 1188.7729 1193.6842 1196.5997 1200.6849 1225.7580 1238.7402 1248.1609 1258.6754 1298.0799 1319.3075 1320.2595 1323.7783 1330.7252 1333.2006 1367.0585 1387.2936 1398.4157 1401.4202 1405.7247 1408.6928 1410.2122 1423.3778 1434.6882 1480.2713 1485.5877 1490.0912 1495.4771 1503.9958 1511.1669 1513.1895 1517.7633 1518.4876 1518.8149 1519.6622 1677.7052 1689.7432 1693.2741 1695.6361 1700.0223 1795.3734 1834.6725 1853.3470 1895.2515 3049.7245 3062.3986 3066.0256 3067.4465 3080.2679 3088.2264 3108.1627 3112.8664 3116.8643 3134.0799 3172.1688 3172.9160 3179.5559 3213.9780 3222.6290 3230.3689 3233.1835 3237.6422 3241.8219 3249.4417 3254.2937
redmass: 6.8174 5.9941 4.4279 7.5816 7.8341 7.6018 6.4670 6.5366 5.6760 6.2046 3.6183 4.9776 4.7755 5.6681 4.4879 7.5572 5.7308 7.7821 1.5630 2.1171 6.3765 6.9533 5.5562 2.0584 12.0725 3.9704 2.9138 9.9929 7.7604 2.4351 1.9005 3.0992 3.0530 5.3213 3.2687 4.2741 4.9455 1.7807 7.3575 7.2236 9.2861 7.2991 9.3696 4.0517 13.8327 4.9967 4.8698 4.8592 8.0597 7.2165 2.5341 2.3262 7.0808 6.3494 6.4738 2.5406 2.3318 1.8791 3.4662 2.7130 3.1789 8.2925 1.6908 2.0113 8.0599 1.3560 1.5657 1.5545 1.6165 1.3989 1.3970 1.5865 1.8250 2.4759 1.3107 1.3435 4.2994 2.1318 2.0723 2.3059 2.3853 3.0210 1.5142 2.4186 1.3691 10.0556 2.0477 1.6578 1.1165 1.4670 1.7599 2.6283 2.0386 2.7970 4.2606 3.7280 2.0139 1.3340 1.8234 1.2185 1.5441 9.2983 1.4712 1.3422 1.4615 8.1774 1.4665 1.5181 1.5454 6.7023 5.3547 1.2898 1.0872 1.0796 1.0937 1.0941 1.0711 1.0941 2.5769 1.9204 2.3154 2.7155 1.3915 9.7164 7.4420 7.3320 7.8012 8.7941 12.7654 13.0062 13.0901 12.9863 1.0648 1.0654 1.0633 1.0687 1.0613 1.0392 1.0971 1.1023 1.1033 1.1049 1.0940 1.1006 1.1025 1.0868 1.0903 1.0950 1.0882 1.0987 1.0916 1.0958 1.0990
irintensity: 0.3628 2.0511 0.3437 4.8459 22.1040 3.3496 2.8217 0.2286 1.3245 3.4752 1.3626 0.8632 4.1035 0.4471 7.0265 4.7646 1.6608 1.0302 0.6090 1.6060 2.0742 0.2237 19.1929 3.0559 1.3177 2.0262 4.3272 26.0184 3.1723 1.6134 1.3110 1.7441 0.1360 3.6297 0.2560 0.6134 0.0626 6.1166 18.5013 30.3601 11.1754 3.9634 8.1879 44.6156 2.2631 0.4779 0.3819 20.4127 1.2185 10.4522 295.5733 82.1666 4.5738 0.3879 1.6759 5.0728 5.7252 9.4336 2.8896 4.2972 4.1891 18.6965 2.0326 6.6483 71.6596 0.1399 4.9999 4.4804 3.7120 1.6679 1.0597 7.3968 6.3124 4.3335 0.0350 0.2499 106.2941 10.7900 139.7514 140.0892 348.3232 0.9443 41.1857 41.9482 0.1678 174.6564 75.0212 2.6696 18.6490 4.6450 3.3483 59.3859 3.1310 136.2677 247.6924 397.0689 18.7291 13.7278 48.5341 3.3594 3.9204 479.2613 1.5366 1.1350 0.8389 29.0783 0.1729 1.3554 2.0575 190.0686 175.9521 18.8494 2.0425 5.2075 5.4581 12.3559 18.1855 8.4267 3.0476 11.6436 19.8157 5.1686 8.3203 1422.3214 3.7520 17.8646 14.2272 652.3003 105.9816 1305.2098 481.1701 339.2751 57.4743 37.8815 46.5359 41.7446 44.0482 22.1965 75.1031 73.4556 97.1718 65.1657 32.2012 33.6330 33.9982 0.2235 5.3206 26.7562 0.7435 26.1584 2.4733 3.1183 9.4119
temp: 298.150 k
press: 1.00000 atm
elementType: 6 1 6 1 6 1 6 1 6 6 7 6 6 8 8 8 6 8 6 1 1 1 6 6 6 6 1 1 6 1 1 6 1 1 1 1 1 1 6 1 6 1 6 1 6 1 6 6 7 6 6 8 8
symmnumber: 1
zpe: 1095046.9 jmol-1
zpe.correction: 0.417081 hartree
zpe.thermalcorrener: 0.444364 hartree
zpe.thermalcorrenthalpy: 0.445308 hartree
zpe.thermalcorrgfe: 0.356624 hartree
zpe.sumelectzpe: -1487.394506 hartree
zpe.sumelectthermal: -1487.367224 hartree
zpe.sumelectthermalent: -1487.366279 hartree
zpe.sumelectthermalfe: -1487.454964 hartree
dipole: -6.9168 21.0995 -6.4470
dipole: 23.1213
quadrupole: -191.4717 -220.2761 -209.2435
quadrupole: 31.9431 4.2872 -0.9790
quadrupole: 15.5254 -13.2790 -2.2464 31.9431 4.2872 -0.9790
hfenergy: -1487.8115878 hartree
pointgroup: C01 [X(C24H21N2O6)]
dipole: -1.2087263 8.9292841 1.2471014 debye
polarizability: 420.9852667|109.8545041|317.1194448|-15.6666375|17.3705688|447.4751284 unknown
InChI: InChI=1/24C.2N.6O.21H
charge -1 multiplicity 1
53 atoms
C  1.53082963 0.96851911 1.27731482
H  1.51843368 1.09000784 2.35493125
C  2.53030986 1.55245554 0.49271004
H  3.31060952 2.13514915 0.97028843
C  2.54863967 1.38869913 -0.89242088
H  3.34258133 1.84725113 -1.47197366
C  1.56596387 0.63886503 -1.54691095
H  1.57940354 0.50998719 -2.62347894
C  0.58168516 0.06497106 -0.76397119
C  0.56478276 0.22632956 0.62364462
N  -1.33073845 -0.90051416 0.03096366
C  -0.58420434 -0.76444931 -1.16011726
C  -0.61104868 -0.49406121 1.17399616
O  -0.90723368 -1.22275596 -2.22939894
O  -0.95268899 -0.69602831 2.3147094
O  -2.25346789 -1.90592494 0.13253805
C  -3.61240046 -1.62383429 0.0061633
O  -4.28590575 -2.61991516 0.05090887
C  -3.57409184 0.49288895 -1.39079365
H  -2.58519565 0.91490063 -1.20387989
H  -3.51075475 -0.19756516 -2.2364303
H  -4.2218638 1.31862499 -1.69055774
C  -4.16029418 -0.19887577 -0.14285928
C  -5.69578237 -0.34943293 -0.30060378
C  -3.86469369 0.60516246 1.15076964
C  -6.44865625 0.98195599 -0.23650658
H  -6.06710046 -0.99309363 0.50317805
H  -5.91232996 -0.86155653 -1.24416172
C  -4.61448845 1.94013731 1.1879863
H  -4.16274441 0.00291024 2.01854221
H  -2.79477505 0.79702383 1.24247258
C  -6.12294432 1.74645219 1.0461409
H  -7.52273757 0.77520839 -0.29526984
H  -6.20796657 1.6066529 -1.10520083
H  -4.37926548 2.44526019 2.13083103
H  -4.24924407 2.59101535 0.38342017
H  -6.63403799 2.71529398 1.05335973
H  -6.4957217 1.1798352 1.91041993
C  4.22422846 -1.3278778 1.6645412
H  3.92740689 -1.43179171 2.70380318
C  5.31902447 -0.53487783 1.30197926
H  5.88488468 -0.01652114 2.07026794
C  5.69525633 -0.39713832 -0.03612025
H  6.54823431 0.22601471 -0.2878268
C  4.98842087 -1.04775599 -1.0537678
H  5.27697721 -0.93794573 -2.09478094
C  3.90799295 -1.82800936 -0.68066489
C  3.53476951 -1.96525781 0.64783989
N  2.02049912 -3.23835799 -0.6334261
C  2.92217233 -2.65180999 -1.47806684
C  2.32556247 -2.87292441 0.64853941
O  2.95634749 -2.76644218 -2.70626663
O  1.72575646 -3.22204377 1.66854697
