program: Gaussian 16
title: continue calc
version: ES64L-G16RevC.01
frameworkgroup: C1[X(C24H21N2O6)]
method: RwB97XD
basis: Gen
operation: Freq
keyword: #P
keyword: Geom=AllCheck
keyword: Guess=TCheck
keyword: SCRF=Check
keyword: GenChk
keyword: RwB97XD/ChkBas
keyword: Freq
converged: YES YES YES YES
title: Mulliken charges:
elementType: C H C H C H C H C C N C C O O O C O C H H H C C C C H H C H H C H H H H H H C H C H C H C H C C N C C O O
charge: -0.142242 0.194050 -0.136758 0.177045 -0.133766 0.177236 -0.149292 0.192400 -0.026888 -0.029552 -0.520337 0.656926 0.648477 -0.573802 -0.570572 -0.043646 0.655109 -0.533450 -0.361424 0.145938 0.143634 0.137655 -0.092071 -0.222179 -0.223686 -0.239382 0.158821 0.136588 -0.237572 0.156753 0.138093 -0.229110 0.128950 0.123136 0.129889 0.123563 0.122823 0.119578 -0.168344 0.165289 -0.155325 0.158259 -0.153694 0.158397 -0.174337 0.165476 -0.008897 -0.014620 -0.726294 0.569237 0.554751 -0.695297 -0.675533
chargesum: -1.00000
title: Mulliken charges with hydrogens summed into heavy atoms:
elementType: C C C C C C N C C O O O C O C C C C C C C C C C C C C N C C O O
charge: 0.051808 0.040287 0.043470 0.043108 -0.026888 -0.029552 -0.520337 0.656926 0.648477 -0.573802 -0.570572 -0.043646 0.655109 -0.533450 0.065803 -0.092071 0.073230 0.071159 0.012704 0.015881 0.013292 -0.003055 0.002933 0.004703 -0.008862 -0.008897 -0.014620 -0.726294 0.569237 0.554751 -0.695297 -0.675533
polarizability: 4.58301407e+02 -6.64601544e+01 3.26153352e+02 -4.21560853e+01 -8.33189180e+01 3.96605937e+02
1716.lowfreq: -0.0006 0.0005 0.0009 3.5699 5.7882 18.0027 19.4777 22.1463 24.2381
frequency: 19.2761 21.8971 23.9774 32.0203 37.2834 46.0204 60.0416 71.8841 82.5890 93.6482 100.8789 127.6331 137.4478 158.1686 175.0108 187.0648 190.1972 197.7752 203.0832 220.6741 249.0205 252.5599 275.2856 308.3502 328.1027 338.8740 351.9304 362.4146 372.7278 391.6202 395.1443 415.0146 419.5111 442.5677 470.2350 471.3091 475.3753 524.9961 531.7382 542.6522 547.1010 566.6414 618.4392 666.5578 679.1582 683.2654 693.6740 700.2228 713.4891 722.1911 730.4548 736.0268 745.8094 762.0392 800.4769 804.4187 809.1718 811.6931 812.9358 813.3269 850.2050 853.7692 871.9306 898.9977 901.4345 915.8469 920.8289 925.4125 961.2168 984.6905 995.9992 997.7706 998.8866 1012.5915 1024.1667 1032.6955 1036.1163 1046.1499 1056.0632 1064.3708 1098.7997 1102.2251 1109.4975 1111.4152 1129.2983 1165.1460 1167.8561 1182.6360 1187.5560 1190.0048 1192.2789 1192.6656 1201.1944 1237.8552 1242.2582 1247.6603 1248.4309 1304.5926 1315.5503 1317.2646 1326.6440 1331.1366 1340.7239 1363.4870 1385.6329 1397.7891 1402.2834 1406.4052 1409.9642 1411.1628 1434.3047 1455.0748 1485.5153 1485.7579 1489.8568 1494.3419 1505.1592 1508.9294 1512.3789 1515.1230 1517.4897 1518.8451 1520.1003 1677.1545 1690.4581 1696.0774 1696.9029 1699.6186 1795.5775 1829.3682 1860.1936 1896.0626 3049.7590 3066.5861 3067.1789 3071.0155 3073.5544 3080.9140 3109.3621 3113.8021 3116.6806 3126.3285 3128.6597 3158.9629 3178.1499 3214.5630 3222.6305 3230.0673 3232.5957 3237.9075 3241.7081 3249.4101 3254.1597
redmass: 4.1649 5.7489 5.8376 6.8119 6.4150 7.3603 9.3798 8.4189 7.7449 6.7892 4.1692 8.5588 5.2472 4.9005 4.1705 7.0804 3.3436 7.3627 1.3036 9.3886 6.9447 6.7544 1.4670 3.4051 3.2980 5.8132 9.8625 10.9698 2.5068 4.5621 2.7107 3.4645 3.0630 2.8090 3.0847 4.8329 4.9223 1.9195 7.3500 5.7653 7.2158 9.2664 7.6025 14.0540 3.2237 4.9936 4.8545 8.0200 3.3474 7.3287 5.7308 2.2501 7.1683 6.3179 5.6268 1.9285 1.5193 2.7373 2.9469 3.7559 2.0367 8.2561 1.8041 3.9574 8.0828 1.3605 1.8387 1.3693 1.5884 1.4027 2.6639 1.7643 1.4444 1.8824 1.3119 3.2672 1.3319 2.1001 1.9188 2.1113 1.4414 2.9226 2.4245 2.7220 1.4142 2.0849 1.6215 2.3819 1.1239 1.4279 5.8504 1.9809 2.1103 3.9926 2.4309 3.6817 1.9558 1.4380 1.1997 1.8563 1.5570 9.2754 1.7031 1.3399 1.4439 1.4239 1.5284 1.6032 5.9509 6.4062 1.2851 10.2714 1.0771 1.0682 1.0958 1.0864 1.0731 1.0817 2.5808 1.0833 2.7488 2.8014 2.6814 9.7420 7.3519 7.8172 7.3823 8.8213 12.7617 13.0805 12.9544 12.9633 1.0652 1.0621 1.0612 1.0618 1.0587 1.0429 1.0969 1.1029 1.1041 1.1050 1.1047 1.1037 1.1012 1.0868 1.0903 1.0951 1.0882 1.0988 1.0916 1.0957 1.0990
irintensity: 5.2795 3.0429 4.8654 10.8204 0.9715 9.2688 1.0781 7.6408 0.5308 7.5575 2.0783 3.1311 0.2957 0.5905 3.6731 10.0497 0.6997 2.8467 0.1040 0.8554 1.3422 1.3291 0.0075 4.7011 0.9827 0.8757 23.0574 15.5972 3.3458 16.5486 3.6418 6.0496 0.1936 8.5193 0.0191 0.0886 0.1759 3.2112 20.2096 13.1234 29.4885 9.9936 28.2131 3.7572 1.9740 0.1039 0.5246 1.4607 162.3000 5.8896 23.2748 140.3731 13.3077 0.2903 0.0030 21.6598 0.4116 5.1754 2.8057 1.3131 3.6442 19.6036 11.5772 69.9649 79.8752 0.1607 0.7995 1.0671 2.5343 1.3877 8.9595 10.3555 0.6139 16.9440 0.0586 89.2513 0.1492 11.4907 14.5177 76.2119 0.6228 1.3607 27.7538 431.1855 0.7120 69.9025 1.3012 31.9724 15.5478 4.4375 122.3346 17.3261 59.6325 281.4584 33.5062 396.5627 1.6432 26.2711 0.6866 55.5579 5.6157 457.9004 2.1649 0.1044 0.0293 0.1408 0.0577 6.1961 122.8486 63.7835 11.2891 209.7075 0.8736 2.1152 5.6398 18.2172 24.4686 1.0748 3.2902 7.5346 2.0278 1.2850 23.4547 1387.8049 2.0140 13.2588 2.3676 649.4190 116.9508 1408.2126 412.6900 149.3476 56.5987 44.4047 21.2203 91.4254 22.1403 25.2368 78.9137 73.6918 41.2933 28.5716 126.3489 34.2888 28.9927 0.0667 4.2184 25.7862 0.8244 25.5972 3.2906 4.1693 9.6341
temp: 298.150 k
press: 1.00000 atm
elementType: 6 1 6 1 6 1 6 1 6 6 7 6 6 8 8 8 6 8 6 1 1 1 6 6 6 6 1 1 6 1 1 6 1 1 1 1 1 1 6 1 6 1 6 1 6 1 6 6 7 6 6 8 8
symmnumber: 1
zpe: 1095180.8 jmol-1
zpe.correction: 0.417132 hartree
zpe.thermalcorrener: 0.444476 hartree
zpe.thermalcorrenthalpy: 0.445420 hartree
zpe.thermalcorrgfe: 0.356592 hartree
zpe.sumelectzpe: -1487.406492 hartree
zpe.sumelectthermal: -1487.379148 hartree
zpe.sumelectthermalent: -1487.378204 hartree
zpe.sumelectthermalfe: -1487.467032 hartree
dipole: -2.0312 -10.8864 -1.4802
dipole: 11.1728
quadrupole: -143.2906 -218.9676 -207.9892
quadrupole: -37.9829 -4.0123 5.4986
quadrupole: 46.7919 -28.8851 -17.9068 -37.9829 -4.0123 5.4986
hfenergy: -1487.8236241 hartree
pointgroup: C01 [X(C24H21N2O6)]
dipole: -1.2295103 -3.9324402 1.5318327 debye
polarizability: 437.7050387|-97.8650564|292.81833|-7.4498391|-14.2551761|450.5373273 unknown
InChI: InChI=1/24C.2N.6O.21H
charge -1 multiplicity 1
53 atoms
C  2.11681745 -1.80690996 -1.22863518
H  2.14275547 -1.74409382 -2.31107362
C  3.14198649 -2.43390374 -0.51251069
H  3.98100928 -2.8639462 -1.04911693
C  3.108012 -2.50837989 0.87969905
H  3.92041295 -2.99769949 1.40652933
C  2.0505288 -1.95481043 1.60931472
H  2.02703552 -2.0055386 2.69242067
C  1.04301789 -1.33546 0.89459485
C  1.07396167 -1.26608266 -0.50060642
N  -0.77537612 -0.15398822 0.2140635
C  -0.19278326 -0.66287848 1.38066564
C  -0.14677819 -0.55759516 -0.97046796
O  -0.65715388 -0.56381682 2.49280696
O  -0.57843474 -0.36927744 -2.08397049
O  -1.99186437 0.45340015 0.21184752
C  -3.05796677 -0.43638557 0.13861976
O  -2.87482515 -1.62400777 0.11561559
C  -5.50094271 -0.7253823 0.13366886
H  -5.43490172 -1.42473245 -0.7041584
H  -5.45386289 -1.29792772 1.06450826
H  -6.47729447 -0.23988404 0.08866323
C  -4.37558886 0.3130106 0.07336717
C  -4.465153 1.30987 1.25882046
C  -4.40505466 1.09856285 -1.26755189
C  -5.68435275 2.22960429 1.1491313
H  -3.56426636 1.93205062 1.27354476
H  -4.48855417 0.74948743 2.20041596
C  -5.62349287 2.01973003 -1.36976968
H  -3.49870427 1.70975963 -1.34205458
H  -4.38855375 0.38857553 -2.10233096
C  -5.69433582 2.98317384 -0.18293821
H  -5.66615164 2.93815591 1.98410559
H  -6.609357 1.64967945 1.25228405
H  -5.56235074 2.57963554 -2.30908197
H  -6.54426124 1.42605105 -1.41948186
H  -6.59038584 3.60886257 -0.25700195
H  -4.82845902 3.65849546 -0.21837999
C  4.51555352 0.63038625 1.38277654
H  4.27316276 0.67597271 2.44020331
C  5.70446061 0.03916275 0.93923482
H  6.40033046 -0.37612809 1.66205959
C  6.00789926 -0.03045259 -0.42208563
H  6.93574975 -0.49820159 -0.73756054
C  5.13413962 0.49190091 -1.38308429
H  5.3679017 0.43529926 -2.4419554
C  3.96376691 1.07490775 -0.92991532
C  3.66079584 1.14081059 0.42199278
N  1.85796175 2.11755093 -0.74064427
C  2.7973866 1.71409569 -1.64979777
C  2.30779396 1.80861382 0.51278656
O  2.7335688 1.8443867 -2.87510588
O  1.7171382 2.02662076 1.57429602
