program: Gaussian 09
title: 000050100
version: EM64L-G09RevD.01
frameworkgroup: C1[X(C12H5Cl5)]
method: RPBEPBE
basis: SDD
operation: Freq
keyword: #pfreq=noraman
keyword: PBEPBE/SDD
title: #p freq=noraman PBEPBE/SDD
converged: YES YES NO NO
title: Mulliken charges:
elementType: Cl Cl Cl Cl Cl C C C C C C C C C C C C H H H H H
charge: 0.026898 -0.020324 0.003754 -0.033718 -0.033475 0.453968 0.401724 -0.311444 -0.361891 -0.281607 -0.338801 -0.047725 -0.083851 -0.197703 -0.222896 -0.230068 -0.099966 0.281341 0.258081 0.285353 0.264185 0.288164
chargesum: 0.00000
title: Mulliken charges with hydrogens summed into heavy atoms:
elementType: Cl Cl Cl Cl Cl C C C C C C C C C C C C
charge: 0.026898 -0.020324 0.003754 -0.033718 -0.033475 0.453968 0.401724 -0.311444 -0.080550 -0.281607 -0.080720 -0.047725 -0.083851 0.087651 0.041289 0.058096 -0.099966
polarizability: 2.50919472e+02 3.63259290e+00 1.67885597e+02 1.12242418e+01 -7.91238455e+00 1.15423895e+02
1716.lowfreq: -2.3942 0.0013 0.0028 0.0035 1.6916 3.9949 21.6172 38.9536 45.3179
frequency: 21.6127 38.9533 45.3162 84.8030 125.1706 142.1672 156.4569 166.1881 184.0132 194.4529 219.4375 244.5781 305.7359 311.7723 324.8124 370.3466 388.0682 410.6588 432.3983 464.7049 504.1874 540.7541 541.4109 582.0543 584.7756 652.4573 717.3285 721.7894 730.1133 775.8009 814.2826 824.5681 866.4796 868.8477 887.5067 954.6888 994.8013 1032.0071 1083.3474 1093.1194 1112.3009 1140.6104 1183.5640 1244.0733 1278.9833 1341.4268 1351.1800 1372.1541 1379.9592 1409.6230 1468.9953 1550.7520 1562.1720 1581.2031 1596.8514 3150.4730 3173.2547 3179.4098 3184.8648 3185.3148
redmass: 14.4231 13.6530 17.8913 20.2260 8.4457 23.6522 9.6278 6.8452 18.3872 23.1758 5.6577 14.7432 8.5566 17.7621 8.7797 9.2093 9.9191 7.0415 3.7001 7.2491 7.2422 6.1074 6.6277 4.1651 4.8863 7.5603 5.8754 6.2657 4.7815 8.8823 7.3961 1.4428 1.4262 1.4136 1.4215 1.3553 7.8373 4.7209 2.7723 3.6294 1.7040 1.3941 1.8948 1.3961 2.0121 4.6001 9.9034 3.9042 3.9674 3.1900 3.4312 7.3628 8.3606 8.3864 7.8523 1.0898 1.0933 1.0962 1.0939 1.0938
irintensity: 0.0948 0.0754 0.0367 0.0811 0.4773 0.2288 0.1490 0.0018 0.9210 0.2007 0.0625 0.4800 0.7526 0.1443 0.4020 3.1142 7.5709 6.2983 5.4876 16.2140 1.0843 9.3074 9.9012 22.3871 17.5670 2.2290 4.3738 25.8846 1.6615 63.2761 74.7774 22.0747 23.9812 19.4393 7.9881 0.0832 24.1261 44.2273 41.6595 14.5208 31.9188 2.1318 9.6946 1.5375 13.3859 14.3377 1.5373 15.4479 52.0816 86.7273 84.1295 53.5156 32.9599 6.6781 72.8289 3.2358 0.0688 0.7600 1.5433 1.8792
temp: 298.150 k
press: 1.00000 atm
elementType: 17 17 17 17 17 6 6 6 6 6 6 6 6 6 6 6 6 1 1 1 1 1
symmnumber: 1
zpe: 340033.3 jmol-1
zpe.correction: 0.129512 hartree
zpe.thermalcorrener: 0.145302 hartree
zpe.thermalcorrenthalpy: 0.146247 hartree
zpe.thermalcorrgfe: 0.083449 hartree
zpe.sumelectzpe: -2759.394168 hartree
zpe.sumelectthermal: -2759.378377 hartree
zpe.sumelectthermalent: -2759.377433 hartree
zpe.sumelectthermalfe: -2759.440231 hartree
dipole: -0.1994 1.5387 -1.1805
dipole: 1.9496
quadrupole: -133.8354 -135.5731 -129.4549
quadrupole: -0.7001 0.5795 -3.3573
quadrupole: -0.8809 -2.6186 3.4996 -0.7001 0.5795 -3.3573
hfenergy: -2759.5236796 hartree
pointgroup: C01 [X(C12H5Cl5)]
dipole: -0.083558 0.4539897 -0.6125972 debye
dipolederiv: -0.2029206 -0.2485542 0.0255749 -0.2536482 -0.5234354 0.0562235 0.0272136 0.0522327 -0.0107851 -0.2605258 0.0185746 -0.2180144 0.0246568 -0.0420868 0.053446 -0.2469248 0.052623 -0.6029445 -0.357726 0.3192913 -0.0432858 0.3581973 -0.4864076 0.0636243 -0.0525621 0.0675704 -0.0340053 -0.3272188 -0.2894246 0.0468797 -0.3575513 -0.6667376 0.0953756 0.0521421 0.0965429 -0.0657106 -0.9384061 0.0104453 -0.0642799 -0.0005649 -0.0553275 0.0100472 -0.0299872 0.0078759 -0.1234231 0.3711205 -0.0729121 -0.0419939 -0.1032136 0.0052042 0.0054841 -0.0305702 -0.0106136 0.0043969 0.1785466 -0.0387017 -0.084896 -0.0321781 -0.0459005 0.0239364 -0.0901781 0.0389199 -0.2577877 -0.0323891 0.4721772 -0.0369765 0.5287455 0.6002291 -0.051448 -0.0627124 -0.0738774 -0.0352674 -0.3086063 -0.1212702 0.0261768 -0.1207702 -0.2260764 0.029639 0.0031941 0.0412493 -0.0937842 0.3427691 -0.0243592 0.3898147 0.0082807 -0.0276264 -0.1116188 0.237999 -0.0819571 0.9229786 0.0261703 0.0016617 0.030114 -0.0500045 -0.1006293 -0.0096615 0.1284895 -0.0203307 0.0895151 0.5088003 -0.4803401 0.0612814 -0.6422626 0.6313363 -0.1052318 0.0830834 -0.1034324 -0.0073046 0.4789529 0.4338521 -0.0664048 0.5365158 1.0109684 -0.1695663 -0.0421622 -0.168721 -0.026482 -0.4903917 0.0190755 -0.1999052 0.0134962 -0.0575344 0.0194572 -0.1408771 0.0101498 -0.2397459 -0.4402641 -0.0022935 0.0597902 0.0134732 -0.1039077 -0.0070017 0.0730555 -0.0148246 -0.0371801 -0.2148017 -0.0244851 0.0114442 0.0252393 -0.4405548 0.0584146 0.0000246 0.0581191 -0.078484 1.400891 -0.0050095 0.0719462 0.0062083 -0.0555234 -0.0386934 0.049492 -0.0322667 0.229241 0.0829663 0.0464849 -0.0138547 0.0701897 0.0320374 0.0101317 -0.0143061 0.0175999 0.140976 0.0423004 -0.01543 0.0704823 -0.0126499 0.1300015 0.0215306 0.0823921 0.0120411 -0.0040948 0.0655643 -0.001824 0.0325821 -0.0105305 0.1628831 0.0147505 0.0307809 0.0146471 0.0506546 0.0435906 0.0081804 -0.0563978 0.0063201 0.1626303 0.0205669 -0.0549087 0.0219583 0.0110786 0.0315779 -0.0051387 -0.0000777 -0.007949 0.0964574 0.0105939 -0.0026781 0.0144939 0.1681587 unknown
polarizability: 251.1472981|6.1052172|159.6590741|8.3870174|-20.7128939|123.4225915 unknown
InChI: InChI=1S/C12H5Cl5/c13-6-1-2-8(10(15)4-6)9-3-7(14)5-11(16)12(9)17/h1-5H
charge 0 multiplicity 1
22 atoms
Cl 0.575398 -2.639974 0.242032
Cl -0.855729 -0.227579 2.64174
Cl 3.826749 -2.453585 0.27866
Cl 3.534472 3.003411 -0.56349
Cl -5.51592 0.113162 -0.321486
C  0.62625 0.129392 -0.125304
C  -0.870342 0.106324 -0.146674
C  1.403072 -1.046436 0.05195
C  1.292338 1.365707 -0.319933
C  -1.658221 -0.051125 1.020231
C  -1.557019 0.284846 -1.376177
C  2.814013 -0.97313 0.053575
C  2.697552 1.409716 -0.318204
C  -3.066363 -0.053155 0.987665
C  -2.966268 0.289036 -1.448117
C  3.478891 0.256501 -0.12927
C  -3.698984 0.115049 -0.258672
H  0.706062 2.278629 -0.453617
H  -0.971158 0.407937 -2.292949
H  -3.646517 -0.175523 1.905158
H  -3.478244 0.420391 -2.404883
H  4.570466 0.300706 -0.125837
