program: Gaussian 16
title: Title Card Required
version: ES64L-G16RevC.01
frameworkgroup: C1[X(C7H7NO2)]
method: RwB97XD
basis: Gen
operation: FOpt
keyword: #p
keyword: opt
keyword: pop=nbo7
keyword: wb97xd/gen
keyword: scrf=(smd,solvent=dimethylsulfoxide)
keyword: int=ultrafine
title: #p opt pop=nbo7 wb97xd/gen scrf=(smd,solvent=dimethylsulfoxide) int=ul
basis: NPDir=0 NMtPBC= 1 NCelOv= 1 NCel= 1 NClECP= 1 NCelD= 1
basis: NCelK= 1 NCelE2= 1 NClLst= 1 CellRange= 0.0.
basis: One-electron integrals computed using PRISM.
basis: One-electron integral symmetry used in STVInt
basis: NBasis= 187 RedAO= T EigKep= 8.30D-04 NBF= 187
basis: NBsUse= 187 1.00D-06 EigRej= -1.00D+00 NBFU= 187
converged: YES YES YES YES
title: Mulliken charges:
elementType: C C C H H C H C O C H N O C H H H
charge: -0.123073 0.049053 -0.128662 0.192391 0.198829 0.145160 0.194714 0.601611 -0.537738 -0.134249 0.183433 -0.527788 -0.464262 -0.145973 0.164297 0.167570 0.164686
chargesum: -0.00000
charge: -0.129513 0.037116 -0.131684 0.186258 0.177434 0.142229 0.195707 0.669461 -0.625297 -0.134651 0.183811 -0.498202 -0.426251 -0.147556 0.165726 0.169684 0.165728
dipole: -2.8159 0.0021 0.0005
dipole: 2.8159
quadrupole: -34.8440 -59.7025 -58.1385
quadrupole: -5.6597 0.0001 0.0011
quadrupole: 16.0510 -8.8075 -7.2435 -5.6597 0.0001 0.0011
hfenergy: -476.0290444 hartree
pointgroup: C01 [X(C7H7N1O2)]
dipole: -0.653336 -0.893989 -0.0364947 debye
InChI: InChI=1/7C.N.2O.7H
charge 0 multiplicity 1
17 atoms
C  1.27853761 4.26108525 -1.09140961
C  2.35700788 3.99230475 1.02664829
C  2.00782614 5.43404071 -1.25667043
H  0.58627138 3.93182004 -1.85921357
H  2.51849588 3.43962905 1.94817522
C  2.88443722 5.81761216 -0.24502865
H  1.9052493 6.04343454 -2.14655671
C  3.66950786 7.08599013 -0.42965869
O  3.56812539 7.78369434 -1.42218214
C  1.45491326 3.52427796 0.07201996
H  0.90905783 2.60364062 0.24607246
N  3.06266569 5.11513361 0.88104228
O  4.47509089 7.36461359 0.58764203
C  5.25120881 8.56637 0.46648576
H  4.59669053 9.43640933 0.38136988
H  5.83985967 8.625095 1.38056124
H  5.90842084 8.51012932 -0.40386456
