program: Gaussian 16
title: Title Card Required
version: ES64L-G16RevC.01
frameworkgroup: C1[X(C18H12Cl2N2O)]
method: RwB97XD
basis: Gen
operation: FOpt
keyword: #p
keyword: opt
keyword: pop=nbo7
keyword: wb97xd/gen
keyword: scrf=(smd,solvent=dimethylsulfoxide)
keyword: int=ultrafine
title: #p opt pop=nbo7 wb97xd/gen scrf=(smd,solvent=dimethylsulfoxide) int=ul
basis: NPDir=0 NMtPBC= 1 NCelOv= 1 NCel= 1 NClECP= 1 NCelD= 1
basis: NCelK= 1 NCelE2= 1 NClLst= 1 CellRange= 0.0.
basis: One-electron integrals computed using PRISM.
basis: One-electron integral symmetry used in STVInt
basis: NBasis= 410 RedAO= T EigKep= 3.28D-04 NBF= 410
basis: NBsUse= 410 1.00D-06 EigRej= -1.00D+00 NBFU= 410
converged: YES YES YES YES
title: Mulliken charges:
elementType: C C C H H C C H N Cl C O N H C C C C H C C H H H C C C C H C H C H H Cl
charge: -0.123947 0.047426 0.079736 0.212003 0.196843 -0.045590 -0.142563 0.195928 -0.382680 0.030512 0.640649 -0.662871 -0.562338 0.208512 0.277322 -0.179427 -0.014770 -0.167428 0.215711 -0.162076 -0.156434 0.156153 0.158481 0.152929 -0.053234 -0.125807 -0.127585 -0.110372 0.176953 -0.108561 0.177276 -0.144123 0.191721 0.191495 -0.039844
chargesum: -0.00000
charge: -0.106180 0.043528 0.024497 0.209526 0.191475 0.003401 -0.141701 0.192753 -0.405344 -0.016969 0.556336 -0.621853 -0.654998 0.397901 0.234002 -0.138662 0.015406 -0.161347 0.176765 -0.166690 -0.149865 0.164619 0.162426 0.162530 -0.006467 -0.142314 -0.124953 -0.119665 0.171029 -0.123305 0.181669 -0.147793 0.189271 0.192926 -0.041957
dipole: 1.7237 2.8902 7.9354
dipole: 8.6195
quadrupole: -132.5381 -151.0849 -139.7488
quadrupole: 11.3909 -20.0085 3.3680
quadrupole: 8.5859 -9.9610 1.3751 11.3909 -20.0085 3.3680
hfenergy: -1798.0001993 hartree
pointgroup: C01 [X(C18H12Cl2N2O1)]
dipole: -2.7479154 1.5134449 -1.2878202 debye
InChI: InChI=1/18C.2Cl.2N.O.12H
charge 0 multiplicity 1
35 atoms
C  -1.71334249 -1.75008736 0.07881263
C  -1.75392856 -3.93384368 1.03550356
C  -0.58079717 -1.46798126 0.84127504
H  -2.11365896 -0.99084609 -0.58621793
H  -2.18061626 -4.92639419 1.14032263
C  -0.12532748 -2.48222762 1.68552696
C  -2.30914946 -3.00213069 0.16992337
H  -3.18519841 -3.25098693 -0.41696107
N  -0.67816264 -3.67392123 1.79187861
Cl 1.25372625 -2.19536864 2.73408227
C  0.11343466 -0.13805919 0.70445052
O  1.21696065 -0.03861504 0.18100325
N  -0.61722938 0.9026731 1.17835633
H  -1.45532763 0.674982 1.6997482
C  -0.19776843 2.25992637 1.18985911
C  0.23122263 2.86470714 0.00901719
C  -0.27696179 2.9962099 2.38364778
C  0.59037734 4.20772601 0.00485452
H  0.2687309 2.2809522 -0.90392932
C  0.06040155 4.35325938 2.34934867
C  0.49727368 4.95669351 1.17529167
H  0.92753013 4.67014005 -0.91727824
H  -0.00153635 4.93134594 3.26663937
H  0.76661071 6.00801386 1.17559525
C  -0.70789649 2.37056209 3.66292425
C  -1.75495748 2.92505764 4.40458216
C  -0.05964872 1.23324375 4.15920831
C  -2.15800085 2.3582411 5.61032636
H  -2.27082097 3.80548855 4.03356202
C  -0.44915477 0.65338061 5.3607662
H  0.77035078 0.80130038 3.60884035
C  -1.49953531 1.22507682 6.07104748
H  -2.97531195 2.79249088 6.17576315
H  0.06380502 -0.22433029 5.73912468
Cl -2.00251624 0.49779262 7.58904184
