program: Gaussian 16
title: Title Card Required
version: ES64L-G16RevC.01
frameworkgroup: C1[X(C8H4F3N)]
method: RwB97XD
basis: Gen
operation: FOpt
keyword: #p
keyword: opt
keyword: pop=nbo7
keyword: wb97xd/gen
keyword: scrf=(smd,solvent=dimethylsulfoxide)
keyword: int=ultrafine
title: #p opt pop=nbo7 wb97xd/gen scrf=(smd,solvent=dimethylsulfoxide) int=ul
basis: NPDir=0 NMtPBC= 1 NCelOv= 1 NCel= 1 NClECP= 1 NCelD= 1
basis: NCelK= 1 NCelE2= 1 NClLst= 1 CellRange= 0.0.
basis: One-electron integrals computed using PRISM.
basis: One-electron integral symmetry used in STVInt
basis: NBasis= 204 RedAO= T EigKep= 3.63D-04 NBF= 204
basis: NBsUse= 204 1.00D-06 EigRej= -1.00D+00 NBFU= 204
converged: YES YES YES YES
title: Mulliken charges:
elementType: C C C C C C H H H H C N C F F F
charge: -0.144224 -0.055996 -0.001687 -0.123052 -0.135389 -0.132637 0.204766 0.205155 0.189677 0.188994 0.361078 -0.561505 1.027059 -0.319949 -0.382253 -0.320037
chargesum: -0.00000
charge: -0.146434 -0.035380 0.009690 -0.109581 -0.132256 -0.124951 0.206013 0.207426 0.190025 0.189835 0.339207 -0.566859 1.022073 -0.332103 -0.384603 -0.332104
dipole: -7.3744 -4.8986 -0.0000
dipole: 8.8532
quadrupole: -57.0773 -74.0833 -68.6773
quadrupole: -3.8163 -0.0001 -0.0001
quadrupole: 9.5353 -7.4707 -2.0647 -3.8163 -0.0001 -0.0001
hfenergy: -661.3525361 hartree
pointgroup: C01 [X(C8H4F3N1)]
dipole: -3.2531815 1.244515 -0.0023303 debye
InChI: InChI=1/8C.3F.N.4H
charge 0 multiplicity 1
16 atoms
C  -0.79536919 -0.27978504 0.00373244
C  0.592066 -0.2954269 0.00434097
C  1.30039319 0.92101127 0.00385977
C  0.61008609 2.13432432 0.00272432
C  -0.78101894 2.13645366 0.00210409
C  -1.47911392 0.93542742 0.00262043
H  -1.34953516 -1.21065561 0.00412048
H  1.16623801 3.06494942 0.00234509
H  -1.31491324 3.08027543 0.00123529
H  -2.56365332 0.93538882 0.00214122
C  2.73600379 0.95855397 0.00452733
N  3.89415882 1.01290494 0.00500101
C  1.33588139 -1.60522752 0.00558784
F  2.13622387 -1.73121521 1.08766732
F  0.51394017 -2.6667176 0.00589159
F  2.13730738 -1.73267572 -1.07551213
