program: Gaussian 16
title: Title Card Required
version: ES64L-G16RevC.01
frameworkgroup: C1[X(C7H5N)]
method: RwB97XD
basis: Gen
operation: FOpt
keyword: #p
keyword: optpop=nbo7
keyword: wb97xd/gen
keyword: scrf=(smd,solvent=dimethylsulfoxide)
keyword: int=ultrafine
title: #p opt pop=nbo7 wb97xd/gen scrf=(smd,solvent=dimethylsulfoxide) int=ul
basis: NPDir=0 NMtPBC= 1 NCelOv= 1 NCel= 1 NClECP= 1 NCelD= 1
basis: NCelK= 1 NCelE2= 1 NClLst= 1 CellRange= 0.0.
basis: One-electron integrals computed using PRISM.
basis: One-electron integral symmetry used in STVInt
basis: NBasis= 141 RedAO= T EigKep= 4.72D-04 NBF= 141
basis: NBsUse= 141 1.00D-06 EigRej= -1.00D+00 NBFU= 141
converged: YES YES YES YES
title: Mulliken charges:
elementType: C C C C C C H H H H C N H
charge: -0.153720 -0.116881 -0.004503 -0.123275 -0.152816 -0.127691 0.176374 0.189189 0.176404 0.174194 0.366747 -0.590976 0.186955
chargesum: -0.00000
charge: -0.151962 -0.112436 -0.000968 -0.112398 -0.151976 -0.123823 0.174963 0.190417 0.174969 0.173995 0.351895 -0.603094 0.190417
dipole: -6.5617 -0.0006 0.0000
dipole: 6.5617
quadrupole: -59.3105 -36.9513 -48.3338
quadrupole: -0.0015 0.0000 0.0000
quadrupole: -11.1119 11.2473 -0.1353 -0.0015 0.0000 0.0000
hfenergy: -324.3900468 hartree
pointgroup: C01 [X(C7H5N1)]
dipole: -2.5815622 0.0000829 -0.0010149 debye
InChI: InChI=1/7C.N.5H
charge 0 multiplicity 1
13 atoms
C  -0.78693342 -0.28099914 0.0037264
C  0.60232744 -0.29005804 0.00428183
C  1.29214032 0.92885646 0.00377366
C  0.60278783 2.14809648 0.00272252
C  -0.78644908 2.13959222 0.00218036
C  -1.47863789 0.92941566 0.00267948
H  -1.33024816 -1.21993765 0.00411221
H  1.15306514 3.08275417 0.00233929
H  -1.32944474 3.07871623 0.00136848
H  -2.56407433 0.92963888 0.00225222
C  2.72764829 0.92857864 0.00433659
N  3.88843784 0.92881132 0.00479091
H  1.15217278 -1.22497697 0.00509142
