program: Gaussian 16
title: Title Card Required
version: ES64L-G16RevC.01
frameworkgroup: C1[X(C6H4N2)]
method: RwB97XD
basis: Gen
operation: Freq
keyword: #P
keyword: Geom=AllCheck
keyword: Guess=TCheck
keyword: SCRF=Check
keyword: GenChk
keyword: RwB97XD/ChkBas
keyword: Freq
converged: YES YES YES YES
title: Mulliken charges:
elementType: C C C H H C N C H C H N
charge: -0.117316 -0.101279 0.166992 0.196899 0.209508 0.386201 -0.588491 -0.132202 0.192818 0.052885 0.187301 -0.453314
chargesum: -0.00000
title: Mulliken charges with hydrogens summed into heavy atoms:
elementType: C C C C N C C N
charge: 0.079582 0.108228 0.166992 0.386201 -0.588491 0.060616 0.240185 -0.453314
polarizability: 1.51692451e+02 4.51601311e-01 1.02798932e+02 -8.03468405e-07 9.73772972e-05 4.32760281e+01
1716.lowfreq: -24.3214 -11.8669 -8.3846 -0.0004 0.0006 0.0012 142.4328 171.7448 384.4840
frequency: 142.4288 171.7430 384.4836 413.7492 486.5024 576.3021 582.2571 647.9337 764.1358 800.2651 811.2447 942.4534 1016.6320 1024.2992 1053.4939 1084.2696 1131.8085 1183.1303 1243.7992 1330.3079 1336.3522 1481.7266 1518.9334 1662.2642 1667.6399 2379.2768 3225.3655 3246.1497 3257.2600 3264.1209
redmass: 6.1592 7.5820 4.4332 3.7406 9.5472 8.8516 3.9858 7.3887 2.3592 6.4704 1.7173 1.2985 1.4071 7.3181 1.3493 2.2799 1.4743 1.1118 3.6571 1.8037 3.5308 2.2392 2.3294 6.4736 5.8379 12.6893 1.0918 1.0904 1.0956 1.1001
irintensity: 0.6993 6.3936 2.9359 12.6645 1.1459 8.8055 25.8485 2.4363 9.1620 6.7443 69.1488 0.9062 1.1641 25.1192 0.0051 8.0330 10.2005 3.2152 1.7976 0.1375 16.1199 35.4071 33.7108 16.2077 49.6081 110.2392 11.9524 3.1815 3.0823 1.3020
temp: 298.150 k
press: 1.00000 atm
elementType: 6 6 6 1 1 6 7 6 1 6 1 7
symmnumber: 1
zpe: 232256.9 jmol-1
zpe.correction: 0.088462 hartree
zpe.thermalcorrener: 0.094393 hartree
zpe.thermalcorrenthalpy: 0.095338 hartree
zpe.thermalcorrgfe: 0.058281 hartree
zpe.sumelectzpe: -340.330971 hartree
zpe.sumelectthermal: -340.325039 hartree
zpe.sumelectthermalent: -340.324095 hartree
zpe.sumelectthermalfe: -340.361152 hartree
dipole: -7.9657 3.1179 0.0000
dipole: 8.5542
quadrupole: -54.3958 -41.0481 -46.7679
quadrupole: 2.1217 0.0000 0.0000
quadrupole: -6.9919 6.3559 0.6361 2.1217 0.0000 0.0000
hfenergy: -340.419433 hartree
pointgroup: C01 [X(C6H4N2)]
dipole: 3.3380275 -0.4288751 -0.000002 debye
dipolederiv: 0.3081217 0.0754562 -0.0000004 -0.0128247 0.1230732 -0.0000002 -0.0000004 -0.0000003 -0.0774037 -0.3920848 0.0744306 0.0000001 0.057333 -0.0062889 -0.0000001 0. 0. -0.073172 0.4439 -0.1093688 0. 0.375515 0.3319483 -0.0000005 -0.0000005 -0.0000002 0.1943404 0.0040956 -0.0591168 0.0000002 -0.0677586 0.0929975 0.0000001 0.0000003 0.0000001 0.1557776 0.1389416 0.0119815 0. 0.0229012 0.0073396 0.0000002 0. 0.0000003 0.1769722 0.7379735 -0.2500374 0. -0.324944 0.267262 0.0000002 0. 0.0000002 0.2248515 -0.8093942 0.1783876 0. 0.2060495 -0.5304498 0. 0. 0. -0.4515814 0.0874305 -0.3021011 0.0000003 0.0571079 -0.3251859 0.0000003 -0.0000002 0.0000006 -0.0794848 0.0193754 0.0794188 0. 0.0731101 0.0788539 0. 0. 0. 0.1630377 -0.0322499 0.381595 -0.0000004 -0.0699528 0.5086025 -0.0000006 0.0000001 -0.0000011 0.0379478 0.0975062 -0.0196046 0. 0.0268268 -0.0721101 0.0000003 0. 0.0000005 0.1475628 -0.6036155 -0.0610411 0.0000002 -0.3433634 -0.4760423 0.0000004 0.0000005 0. -0.4188481 unknown
polarizability: 140.038481|-20.8372866|114.4529017|-0.0000475|-0.000085|43.2760281 unknown
InChI: InChI=1/6C.2N.4H
charge 0 multiplicity 1
12 atoms
C  2.34188565 0.71213754 -0.00000181
C  1.1401757 1.41447163 -0.00000184
C  -0.03783556 0.67360299 0.00000028
H  3.28631926 1.24508285 -0.00000335
H  1.11010923 2.49782363 -0.00000337
C  -1.3133535 1.35603416 0.00000022
N  -2.33047392 1.91137742 0.00000008
C  2.30580019 -0.67512649 0.0000002
H  3.21786879 -1.26100775 0.00000026
C  1.0672316 -1.31871229 0.00000206
H  1.0081088 -2.4030136 0.00000364
N  -0.0957522 -0.66682606 0.00000219
