program: Gaussian 16
title: Title Card Required
version: ES64L-G16RevC.01
frameworkgroup: C1[X(C8H4N2)]
method: RwB97XD
basis: Gen
operation: Freq
keyword: #P
keyword: Geom=AllCheck
keyword: Guess=TCheck
keyword: SCRF=Check
keyword: GenChk
keyword: RwB97XD/ChkBas
keyword: Freq
converged: YES YES YES YES
title: Mulliken charges:
elementType: C C C C H H C N C H C H C N
charge: -0.149253 -0.086077 0.004985 0.004879 0.194664 0.208573 0.361273 -0.586484 -0.073959 0.224047 -0.086042 0.208568 0.361304 -0.586480
chargesum: -0.00000
title: Mulliken charges with hydrogens summed into heavy atoms:
elementType: C C C C C N C C C N
charge: 0.045411 0.122497 0.004985 0.004879 0.361273 -0.586484 0.150088 0.122526 0.361304 -0.586480
polarizability: 1.94485244e+02 4.54779059e-03 1.40002403e+02 3.41405189e-04 2.42156899e-04 4.62060743e+01
1716.lowfreq: -34.0798 -24.5338 -14.0965 -0.0008 0.0005 0.0011 118.2526 121.0031 158.0464
frequency: 118.2526 120.9924 157.9980 198.2383 386.5522 396.8250 463.4545 463.9600 535.0755 539.3199 612.9424 642.1765 695.2320 718.7797 833.6975 922.4909 944.0065 982.7242 1022.5303 1037.2334 1135.3247 1180.2850 1203.5830 1276.9887 1325.5390 1362.9411 1477.2289 1531.6227 1659.2442 1687.5653 2371.0214 2373.6774 3244.6139 3251.7693 3253.0470 3261.1802
redmass: 11.9166 6.5878 5.5638 6.7698 5.5124 3.6941 8.0326 10.2509 5.8790 10.4912 7.0430 7.6109 2.1535 7.4606 1.4398 4.9966 1.4667 1.3704 6.1816 1.3512 1.6250 1.7091 1.1060 5.0737 1.8887 2.6993 3.4064 2.5152 5.8306 6.2098 12.6838 12.6819 1.0896 1.0941 1.0955 1.0994
irintensity: 20.9278 13.0712 0.0000 4.4369 0.0001 2.1378 0.0965 1.4590 31.1113 2.7135 1.9385 0.0000 42.9807 0.3229 42.8716 11.9026 17.1818 0.0000 1.9475 0.2216 12.4838 13.7574 6.7229 5.1306 1.8917 6.5435 13.9453 20.6724 0.0002 16.6591 290.8147 79.3509 0.4792 0.0240 2.9895 0.9998
temp: 298.150 k
press: 1.00000 atm
elementType: 6 6 6 6 1 1 6 7 6 1 6 1 6 7
symmnumber: 1
zpe: 259518.5 jmol-1
zpe.correction: 0.098845 hartree
zpe.thermalcorrener: 0.106685 hartree
zpe.thermalcorrenthalpy: 0.107629 hartree
zpe.thermalcorrgfe: 0.065811 hartree
zpe.sumelectzpe: -416.499927 hartree
zpe.sumelectthermal: -416.492088 hartree
zpe.sumelectthermalent: -416.491143 hartree
zpe.sumelectthermalfe: -416.532962 hartree
dipole: 0.0004 6.2811 0.0000
dipole: 6.2811
quadrupole: -91.3305 -51.7711 -57.7217
quadrupole: 0.0009 -0.0001 0.0000
quadrupole: -24.3894 15.1700 9.2194 0.0009 -0.0001 0.0000
hfenergy: -416.5987726 hartree
pointgroup: C01 [X(C8H4N2)]
dipole: 2.1433725 1.2299027 -0.0000062 debye
dipolederiv: -0.0140511 0.3008805 -0.0000012 0.3007611 -0.3656277 0.0000003 -0.0000012 0.0000004 -0.1508533 0.2325331 -0.1865535 0.0000004 0.119977 0.0518759 -0.0000005 -0.0000009 -0.0000003 -0.0465525 -0.1869482 0.0902331 0. 0.0131479 -0.08475 0.0000005 0. 0.0000003 0.0309915 -0.0657268 -0.0577516 0.0000004 0.0193938 -0.2059837 0.0000008 0.0000003 0.0000009 0.0309341 0.0081663 -0.0578956 0.0000004 -0.0579322 0.0758149 0.0000004 0.0000003 0.0000004 0.1666525 0.134869 0.0134994 0. 0.007788 0.0092242 0.0000005 0. 0.0000006 0.1689717 0.8727237 -0.5018269 0.0000011 -0.453559 0.3973834 0. 0.0000012 0. 0.2416877 -0.8531432 0.2809398 -0.0000005 0.2444326 -0.6077433 0.0000002 -0.0000004 0.0000001 -0.469994 0.0159287 -0.1182164 0.0000002 -0.1182811 0.1541204 -0.0000006 0.0000002 -0.0000004 -0.0524398 0.0753718 -0.0365419 0.0000003 -0.0365106 0.1180822 0.0000003 0.0000002 0.0000003 0.1864527 0.068956 0.215642 -0.0000008 -0.0908122 0.2157127 -0.0000007 0.0000003 -0.0000011 -0.0465264 0.0505004 0.0570864 0. 0.0628348 0.0936076 0.0000002 0. 0.0000002 0.1689746 0.102143 -0.0031279 0. -0.0514559 1.1678115 -0.0000032 0. -0.0000032 0.2416768 -0.4413226 0.0036325 0. 0.0402158 -1.0195281 0.0000018 -0.0000001 0.0000018 -0.4699755 unknown
polarizability: 153.4909755|-23.5149778|180.9966717|-0.0000401|-0.0004166|46.2060743 unknown
InChI: InChI=1/8C.2N.4H
charge 0 multiplicity 1
14 atoms
C  2.31988538 0.68320363 -0.00000184
C  1.12006431 1.38405725 -0.00000292
C  -0.09131549 0.68138758 0.00000074
C  1.1017408 -1.39767567 0.00000642
H  3.25989668 1.22281624 -0.00000465
H  1.1152693 2.46842278 -0.00000643
C  -1.33223248 1.40426222 -0.00000032
N  -2.33262203 1.99066448 -0.00000107
C  -0.11471142 -0.7138025 0.00000545
H  -1.0549018 -1.25327542 0.0000083
C  2.3196713 -0.70629528 0.00000279
H  3.2533434 -1.25772152 0.0000036
C  1.09941993 -2.83388091 0.00001105
N  1.10074133 -3.99350546 0.00001467
