program: Gaussian 16
title: displacement calc 0.5
version: ES64L-G16RevC.01
frameworkgroup: C1[X(C21H29N4)]
method: UwB97XD
basis: Gen
operation: Freq
keyword: #P
keyword: Geom=AllCheck
keyword: Guess=TCheck
keyword: SCRF=Check
keyword: GenChk
keyword: UwB97XD/ChkBas
keyword: Freq
converged: YES YES NO YES
polarizability: 4.30464949e+02 7.80865645e+01 3.13917737e+02 4.92945786e+00 6.19951513e+00 3.36695480e+02
1716.lowfreq: -7.9048 -4.4858 0.0002 0.0006 0.0009 9.7916 12.2277 13.8353 22.3393
frequency: 9.9205 13.5887 22.2262 41.8844 43.5243 50.2061 55.5582 65.9719 73.5828 88.5161 113.9421 134.2902 160.1113 173.6045 192.0879 212.6866 266.9430 273.0457 294.5446 308.8487 339.5200 342.7665 344.7722 395.8458 401.4751 408.8168 436.9438 437.9517 443.8908 453.8878 468.1573 490.9476 514.3547 530.4548 587.2059 597.4314 597.8923 618.9583 627.9874 642.1826 673.1034 706.6645 734.9648 787.4904 797.4838 805.2307 814.8718 823.9313 836.1131 844.4580 846.5215 860.8422 869.0258 890.4027 915.1869 926.1871 926.4859 929.0640 954.7965 970.5502 994.9112 998.8433 999.6801 1004.5976 1014.6603 1020.3927 1039.1515 1068.9833 1069.0892 1069.4294 1094.1153 1111.4036 1119.3329 1119.7322 1130.9262 1151.5773 1167.4862 1187.8738 1189.6059 1210.0924 1212.8308 1218.8030 1219.2389 1252.5379 1259.7709 1272.0216 1275.9186 1291.3595 1297.8695 1320.2649 1338.9211 1339.3254 1349.8737 1351.4332 1352.2999 1366.9942 1370.7417 1372.1047 1373.8287 1374.2003 1379.2646 1382.6371 1387.4218 1399.3389 1401.1408 1403.3661 1410.5889 1419.3737 1428.8951 1470.1465 1483.4760 1485.2020 1487.7194 1488.7274 1489.4765 1493.9384 1496.4200 1497.2778 1497.8195 1502.2398 1502.9498 1508.4503 1513.5921 1559.9535 1656.2326 2287.6017 2367.6575 2824.4357 3045.8869 3050.3818 3054.3078 3056.0481 3057.3660 3060.4569 3064.2523 3065.7161 3067.3228 3076.2366 3076.6003 3081.9549 3103.1782 3104.5076 3108.0230 3113.2730 3115.0152 3116.1045 3117.5552 3118.5707 3131.5689 3136.3596 3137.7543 3138.1208 3151.0627 3232.6387 3247.4681 3249.2644
redmass: 4.9804 7.0558 3.1972 4.3586 3.8924 3.9947 3.6808 1.7293 5.4587 5.9848 11.4970 3.4018 4.1771 6.3189 2.0041 2.1471 1.7653 3.2549 3.4148 2.9070 2.1510 1.7256 1.7261 2.6521 2.6176 3.3110 2.3411 2.3380 3.9954 4.1074 2.9425 4.5536 2.7972 4.2447 5.4211 3.5873 3.6078 8.2149 3.8412 6.5833 3.6455 6.9110 2.5605 3.0489 3.7721 1.4607 1.9659 1.1586 5.0308 1.2535 1.2525 1.9657 2.0419 2.2864 1.9135 3.0163 2.7026 1.9677 1.5496 2.5826 1.3157 2.7338 1.5830 5.2835 1.7632 2.2303 1.5319 2.4723 2.1814 2.2684 1.6834 1.8423 2.6287 2.6281 1.3281 2.1066 3.0661 2.0842 1.4917 1.1920 1.0546 1.8974 1.9101 1.3012 1.8134 3.4571 1.0896 1.8011 1.2280 1.2631 1.2247 1.2247 1.2684 1.2534 1.5654 1.4211 1.5594 1.5730 1.5881 1.5888 1.8948 1.5882 1.4061 1.4278 1.4384 1.5821 1.6641 2.0697 1.2996 1.8896 1.0880 1.0760 1.0818 1.0819 1.0923 1.0874 1.0844 1.0850 1.1033 1.0672 1.0972 1.0787 1.0942 5.4229 6.1174 12.6520 12.6728 1.0808 1.0644 1.0632 1.0508 1.0593 1.0620 1.0556 1.0594 1.0594 1.0604 1.0600 1.0599 1.0629 1.0968 1.1009 1.1025 1.1030 1.1020 1.1078 1.1078 1.1079 1.1029 1.1085 1.1086 1.1087 1.1005 1.0887 1.0914 1.0951
irintensity: 1.9766 3.1844 0.5683 1.0160 0.2326 0.1370 0.7367 0.0476 10.5538 8.2395 6.6222 1.5558 3.2755 9.3698 3.1559 3.5200 1.2877 0.1078 1.1593 1.5613 0.1044 0.0992 0.0311 1.0942 1.4371 0.9184 1.5089 0.8127 0.8286 0.0653 0.0651 7.8831 12.5616 23.6347 3.7755 0.0064 0.0027 2.2015 3.4185 0.8173 3.2528 1.3614 13.8084 21.2941 170.7829 1.8871 35.8201 0.0286 7.9765 16.0811 15.2216 0.3427 0.3797 12.4049 18.8781 4.9219 10.0963 28.7809 1.3053 43.7622 6.1009 0.1390 7.0418 24.7439 5.9048 5.7992 0.0027 0.7855 4.2035 2.8801 9.4162 8.0417 69.7616 63.4225 1.8271 41.8515 8.8082 72.0061 3.4149 5.3790 0.2926 0.6179 0.0814 33.7131 2.7618 30.7306 0.0155 18.6895 1.8855 6.4017 0.2288 0.9985 1.1305 5.2990 30.4504 3.1039 14.1359 18.8626 14.1662 10.4471 7.0802 3.8979 1.0828 16.5866 12.8344 1.4845 5.8980 21.2424 18.1592 9.0470 0.7324 2.5339 0.6417 0.2488 4.1633 17.3573 7.2868 7.6054 16.5463 6.3494 0.3506 1.3929 3.3950 7.8971 26.6410 499.7662 185.3700 1246.5773 59.7390 46.0032 22.2861 74.4310 50.1762 29.1838 42.0619 52.2510 112.3445 138.3751 131.4209 12.8177 97.0897 105.7758 57.9412 33.5252 133.1319 8.2069 5.7557 3.0702 47.3446 7.3026 130.2898 140.6676 49.8129 0.1131 4.1868 5.4894
temp: 298.150 k
press: 1.00000 atm
elementType: 6 6 6 6 6 1 1 1 6 6 7 7 6 1 6 6 6 6 1 1 6 1 1 6 1 1 1 1 1 1 6 1 1 1 7 6 1 1 6 1 1 7 6 1 1 6 1 1 6 1 1 6 1 1
symmnumber: 1
zpe: 1246894.4 jmol-1
zpe.correction: 0.474917 hartree
zpe.thermalcorrener: 0.498874 hartree
zpe.thermalcorrenthalpy: 0.499818 hartree
zpe.thermalcorrgfe: 0.416285 hartree
zpe.sumelectzpe: -1035.886915 hartree
zpe.sumelectthermal: -1035.862958 hartree
zpe.sumelectthermalent: -1035.862014 hartree
zpe.sumelectthermalfe: -1035.945547 hartree
dipole: -11.8378 -5.9346 -3.4338
dipole: 13.6801
quadrupole: -226.3572 -162.2475 -152.6731
quadrupole: -20.8084 -11.3650 -4.5201
quadrupole: -45.9313 18.1785 27.7528 -20.8084 -11.3650 -4.5201
hfenergy: -1036.3618315 hartree
pointgroup: C01 [X(C21H29N4)]
dipole: -4.8821246 2.108949 -0.8276003 debye
polarizability: 440.0919809|-70.0411367|304.2601751|-4.9878505|3.7325423|336.7260093 unknown
InChI: InChI=1/21C.4N.29H
charge 0 multiplicity 2
54 atoms
C  0.70174712 -1.23375484 -1.82324815
C  1.92878816 -1.7311275 -2.13501717
C  2.83722314 -2.12331322 -1.11517093
C  2.44499879 -1.94505312 0.26258662
C  1.2189484 -1.45234722 0.58712959
H  0.0513915 -0.9206509 -2.63265863
H  2.23755637 -1.82807652 -3.17053945
H  0.97839667 -1.31367971 1.63536707
C  4.10357268 -2.65249555 -1.44690969
C  3.36425454 -2.28030718 1.31260327
N  4.10751463 -2.55332084 2.16034962
N  5.14800879 -3.08958625 -1.72505069
C  0.20165774 -1.07220759 -0.42721284
H  -0.02278756 0.00687585 -0.26758426
C  -1.21061972 -1.74435519 -0.17225493
C  -1.66844412 -1.38597505 1.26043035
C  -2.21114787 -1.14886356 -1.1896608
C  -3.13605068 -1.71838618 1.5449144
H  -1.51830725 -0.30836647 1.41275221
H  -1.04091658 -1.90402403 1.99369138
C  -3.67508385 -1.48355331 -0.8904193
H  -2.09549463 -0.05622913 -1.18919255
H  -1.96645426 -1.4965711 -2.19891967
C  -4.06556266 -1.06378817 0.52512314
H  -3.38542609 -1.38819144 2.55958823
H  -3.28487058 -2.80576699 1.52535287
H  -4.31238341 -0.98431002 -1.6289596
H  -3.84589279 -2.56139812 -1.00904267
H  -5.10875396 -1.32875211 0.73064843
H  -3.9877913 0.02912331 0.6132474
C  -1.08892991 -3.26273329 -0.34550461
H  -0.74384459 -3.51447843 -1.35444372
H  -0.37348364 -3.68215264 0.37096509
H  -2.04763036 -3.7649043 -0.18764752
N  -0.60607483 1.95541777 0.06447823
C  -0.16347406 2.56013753 -1.19729363
H  -0.87965982 2.28159201 -1.97739818
H  0.80613992 2.12485214 -1.46291006
C  0.35299829 2.28793644 1.12445583
H  1.32301754 1.85540437 0.85536001
H  0.018159 1.80667605 2.0493578
N  -0.45817769 4.49173541 0.3290633
C  -1.9245588 2.49174599 0.42086521
H  -2.2497348 2.01264817 1.35036298
H  -2.63314277 2.21010015 -0.36514131
C  0.44323122 3.83241331 1.28648902
H  0.15567354 4.14194336 2.29620683
H  1.46057741 4.19173967 1.10235606
C  -0.06914866 4.10451912 -1.03572533
H  0.95028957 4.46048875 -1.21481011
H  -0.73224243 4.61757646 -1.73937707
C  -1.83489417 4.03783158 0.57940073
H  -2.49682362 4.54728565 -0.12799147
H  -2.11982855 4.34919786 1.58933369
