program: Gaussian 09
title: 000050150
version: EM64L-G09RevD.01
frameworkgroup: C1[X(C18H19ClN2OS)]
method: RPBEPBE
basis: SDD
operation: Freq
keyword: #p
keyword: freq=noraman
keyword: PBEPBE/SDD
title: #p freq=noraman PBEPBE/SDD
converged: YES YES NO NO
title: Mulliken charges:
elementType: Cl S O N N C C C C C C C C C C C C C C C C C C H H H H H H H H H H H H H H H H H H H
charge: -0.060403 0.178768 -0.408760 -0.111074 -0.291841 -0.181766 -0.319634 -0.317514 -0.612498 0.633334 -0.437318 -0.438835 0.589830 -0.630628 -0.328605 -0.503763 -0.403497 0.395724 -0.057541 -0.268752 -0.376119 -0.245425 -0.242868 0.202453 0.190363 0.218676 0.223877 0.192364 0.232638 0.256325 0.195807 0.206492 0.208010 0.197233 0.268197 0.270027 0.231341 0.247196 0.283010 0.232428 0.234670 0.348081
chargesum: 0.00000
title: Mulliken charges with hydrogens summed into heavy atoms:
elementType: Cl S O N N C C C C C C C C C C C C C C C C C C
charge: -0.060403 0.178768 -0.060679 -0.111074 -0.023644 0.020687 0.089405 0.098727 -0.123535 0.633334 -0.035020 -0.033592 0.589830 -0.630628 -0.328605 -0.233737 -0.172156 0.395724 -0.057541 -0.021556 -0.093110 -0.012997 -0.008198
polarizability: 3.12422441e+02 -3.07549888e+01 2.01071972e+02 -4.81173189e+00 -2.30089637e+01 1.99692643e+02
1716.lowfreq: -0.0026 -0.0019 -0.0018 6.6989 11.5616 14.2655 25.4556 38.0227 56.3702
frequency: 25.2445 37.8290 56.1938 67.4469 74.5808 100.5416 146.0048 162.9051 175.7696 209.4350 218.6123 233.9610 245.6944 255.9042 268.4615 291.6242 300.4648 319.1887 325.5153 375.7631 395.6492 413.3589 433.0491 442.5364 459.6735 477.5767 506.6542 516.5133 527.7917 539.7314 572.0936 577.5056 583.5548 601.6248 633.1431 649.2031 685.4505 696.5648 713.3232 742.6381 753.8875 763.0367 822.6691 840.6380 852.5534 862.3270 864.7290 869.0529 886.5161 920.1527 935.4967 951.6903 967.4078 983.9407 1018.8478 1027.8334 1034.8873 1040.3984 1057.1354 1064.9083 1071.4808 1096.0623 1103.6542 1123.6533 1133.7281 1140.2153 1167.5484 1175.6174 1175.9825 1203.4582 1206.5955 1220.5345 1233.4986 1240.9742 1258.8191 1271.5165 1286.1712 1297.2028 1307.0725 1324.7069 1340.4934 1349.9585 1359.0514 1376.1827 1379.6795 1386.7703 1388.8032 1419.6496 1427.5896 1443.1629 1451.9866 1454.8567 1460.4561 1461.9575 1466.9447 1473.6818 1478.9511 1576.1216 1583.6370 1590.3064 1600.4809 2803.1045 2852.1054 2866.1796 2882.5164 2887.6739 2980.7519 3031.4136 3036.8661 3041.8790 3054.5639 3057.5005 3113.7502 3129.6933 3144.9763 3158.1579 3166.1736 3189.8746 3359.9446 3456.4135
redmass: 6.8926 5.7149 5.3378 3.2660 6.4288 4.2913 4.1517 9.3185 6.4029 5.1447 4.6401 4.6822 5.5063 3.9604 2.9312 3.4009 2.7649 4.0362 5.6844 7.7295 2.4477 4.0634 3.3855 4.3599 3.0204 3.6682 3.9261 3.1853 5.0188 3.0430 3.9801 1.2262 5.0065 3.0619 4.7692 6.3098 3.3877 1.7152 3.9336 3.2270 1.4979 3.3346 4.8171 3.8915 1.4794 1.5128 1.4556 1.5821 2.6848 2.4706 2.1908 1.7146 2.8141 1.3372 6.5330 6.0126 2.7772 3.0642 1.7888 2.0904 1.9209 1.6641 2.1332 1.7772 2.5269 2.7424 3.1353 1.1467 1.3377 1.6709 1.3197 1.3936 1.2456 1.4195 1.4982 1.2611 2.3546 1.4585 1.2381 1.2431 1.5340 1.4009 2.4687 4.0155 2.9193 1.4056 1.5477 2.0431 2.8270 1.3535 2.5236 1.0962 1.0876 1.4970 1.1157 1.1381 1.4787 6.2673 6.9950 7.3812 6.3838 1.0802 1.0705 1.0698 1.0701 1.0685 1.0630 1.0975 1.0902 1.0917 1.0869 1.0888 1.0880 1.0876 1.0931 1.0921 1.1010 1.0935 1.0639 1.0752
irintensity: 0.0259 0.0421 0.2292 0.0119 0.0589 0.3407 4.3237 0.2404 0.3796 1.2210 0.5347 0.6457 0.2094 0.5093 4.3699 1.5225 3.6464 5.8946 1.8714 4.7833 1.9483 5.2608 2.7840 17.7206 0.0874 22.6286 1.4441 8.6091 7.6220 58.4716 31.3331 71.3174 5.7531 2.7209 3.2258 12.4518 8.3707 82.0637 0.4350 19.9423 42.1667 35.9692 31.7331 50.9798 1.2457 4.8684 7.9546 40.5721 8.8486 6.5155 4.6844 5.6796 20.8575 0.0866 35.4029 20.8499 8.3137 14.4973 1.0580 15.7854 4.8028 16.1554 6.5739 1.4421 37.6728 41.8131 20.3520 23.7969 134.2810 8.3723 9.9491 39.3157 44.5889 15.3190 17.1271 1.0762 5.2700 7.4277 3.0794 38.8982 34.2580 5.8748 0.4574 52.3609 10.9482 3.9679 10.7221 11.4845 20.1073 3.1149 61.1624 1.5627 1.8377 6.7749 11.5799 7.6517 37.1937 24.2293 72.6149 85.5309 3.4599 66.9477 71.4671 55.5886 34.3676 185.9306 17.4898 26.6432 43.1302 51.9133 48.9201 10.5170 9.4829 1.2197 17.1327 0.2975 31.9105 0.2924 103.8573 1.9073
temp: 298.150 k
press: 1.00000 atm
elementType: 17 16 8 7 7 6 6 6 6 6 6 6 6 6 6 6 6 6 6 6 6 6 6 1 1 1 1 1 1 1 1 1 1 1 1 1 1 1 1 1 1 1
symmnumber: 1
zpe: 875066.2 jmol-1
zpe.correction: 0.333295 hartree
zpe.thermalcorrener: 0.353274 hartree
zpe.thermalcorrenthalpy: 0.354218 hartree
zpe.thermalcorrgfe: 0.284514 hartree
zpe.sumelectzpe: -1738.458346 hartree
zpe.sumelectthermal: -1738.438367 hartree
zpe.sumelectthermalent: -1738.437423 hartree
zpe.sumelectthermalfe: -1738.507127 hartree
dipole: 4.2901 0.1681 -0.8360
dipole: 4.3740
quadrupole: -152.1772 -149.0849 -142.7351
quadrupole: -4.5925 -0.5710 1.7551
quadrupole: -4.1781 -1.0859 5.2640 -4.5925 -0.5710 1.7551
hfenergy: -1738.7916409 hartree
pointgroup: C01 [X(C18H19Cl1N2O1S1)]
dipole: -1.69073 0.2746563 0.1653713 debye
polarizability: 317.4476629|11.7295989|191.3076088|12.1428963|24.2662227|204.4317852 unknown
InChI: InChI=1S/C18H19ClN2OS/c19-13-10-14-15(21-7-5-20-6-8-21)9-12-3-1-2-4-17(12)23-18(14)16(22)11-13/h1-4,10-11,15,20,22H,5-9H2
charge 0 multiplicity 1
42 atoms
Cl 5.388794 -0.471706 1.647755
S  -0.135656 -0.848655 -1.654922
O  2.414236 -2.369008 -2.133741
N  -0.400256 1.731834 0.235535
N  -1.266709 4.303476 -0.727074
C  0.246934 0.774009 1.166847
C  -1.562726 2.431637 0.844703
C  0.564883 2.712259 -0.330685
C  -0.748756 -0.288828 1.727452
C  1.459331 0.062072 0.559204
C  -2.249782 3.33815 -0.192873
C  -0.129837 3.608644 -1.369264
C  -1.746653 -0.97416 0.790861
C  1.356349 -0.762256 -0.586365
C  -1.559165 -1.323929 -0.574746
C  2.696949 0.135732 1.242612
C  -2.981919 -1.363547 1.384467
C  2.48041 -1.516736 -1.034385
C  3.799173 -0.599152 0.763724
C  -2.566202 -2.017024 -1.295394
C  3.72025 -1.432789 -0.359308
C  -3.988713 -2.050597 0.678403
C  -3.780117 -2.378883 -0.679488
H  0.635425 1.317771 2.070759
H  -1.244915 3.058917 1.717167
H  -2.295991 1.685694 1.196092
H  1.388877 2.161558 -0.81647
H  1.001527 3.359208 0.471913
H  -1.334534 0.178071 2.540554
H  -0.1292 -1.065143 2.21994
H  -2.687483 2.681758 -0.984883
H  -3.073616 3.88922 0.297168
H  0.590297 4.358545 -1.744529
H  -0.445938 2.961264 -2.223795
H  -1.695472 5.012703 -1.334969
H  2.793252 0.763663 2.133045
H  -3.146947 -1.110964 2.439698
H  -2.390981 -2.278189 -2.345229
H  4.568559 -2.019922 -0.717455
H  -4.922253 -2.325648 1.180482
H  -4.544403 -2.91474 -1.252177
H  1.464479 -2.411008 -2.449728
