program: Gaussian 16
title: Title Card Required
version: ES64L-G16RevC.01
frameworkgroup: C1[X(C15H17N2)]
method: UwB97XD
basis: Gen
operation: Freq
keyword: #P
keyword: Geom=AllCheck
keyword: Guess=TCheck
keyword: SCRF=Check
keyword: GenChk
keyword: UwB97XD/ChkBas
keyword: Freq
converged: YES YES YES YES
polarizability: 2.60099891e+02 1.33590223e+01 2.93051645e+02 3.62473556e+01 -8.67193745e+00 1.81214936e+02
1716.lowfreq: -1.9003 -0.0005 0.0003 0.0007 4.9404 12.9826 34.4892 49.0042 95.5499
frequency: 34.1777 48.9491 95.5469 116.3133 129.9747 142.6233 178.2757 196.3389 200.5443 274.4637 286.5406 293.3276 312.6866 340.2856 386.4232 405.4794 412.9638 416.7277 467.7970 476.8416 492.7599 518.6498 547.0070 567.2875 615.9946 634.8090 670.2466 719.0454 741.6295 787.5375 804.4766 812.8027 857.7615 866.9367 884.0575 897.5277 918.7825 952.0237 998.2222 1005.3583 1008.8682 1014.7265 1019.1336 1068.2390 1074.7605 1102.7707 1132.0486 1137.1403 1145.9917 1178.0113 1189.7689 1200.1938 1215.6919 1245.5106 1262.8614 1281.6326 1296.8170 1308.8022 1322.7056 1351.3659 1370.1141 1386.0834 1402.6282 1404.6237 1411.3343 1413.9571 1432.0256 1440.2454 1482.7837 1485.2312 1490.3099 1493.8467 1503.8347 1509.9292 1512.4503 1543.2121 1633.0902 2294.3510 2370.3226 3044.9950 3045.7924 3048.1088 3059.3301 3060.4336 3061.2277 3069.5288 3104.7123 3107.2742 3110.9458 3114.4132 3120.0398 3146.1325 3160.0813 3234.8525 3250.2252 3259.4052
redmass: 3.3726 7.7256 5.8887 5.5692 6.0719 3.7007 3.6508 3.2880 1.7636 1.5977 3.5334 2.9529 3.8123 2.1697 4.6578 2.1734 2.7316 5.2496 3.1007 3.8165 5.4695 2.0423 4.8584 7.4425 4.3725 3.6676 4.1073 1.9390 4.0517 2.5450 1.4507 5.1190 2.5620 1.6449 2.0806 1.7208 1.9088 1.5174 1.8627 1.8551 1.5701 1.8104 2.0439 1.9255 2.5422 1.4964 1.7136 1.6604 2.1384 1.7732 1.4667 1.1958 2.6644 1.4343 1.9048 1.8042 1.2350 5.3916 1.2530 1.6260 1.3646 1.4894 1.4846 1.5378 1.7932 1.6824 1.3084 1.7316 1.0837 1.0727 1.0947 1.0893 1.0675 1.0726 1.0929 4.2882 5.1748 12.6752 12.6854 1.0654 1.0650 1.0660 1.0632 1.0676 1.0772 1.0402 1.0969 1.1011 1.1024 1.1011 1.0989 1.1030 1.1004 1.0877 1.0942 1.0958
irintensity: 2.2730 0.1628 9.8423 2.3343 4.1227 0.2055 10.0782 2.6933 2.1873 1.2730 0.7752 2.3703 2.2130 0.3685 5.7068 0.6510 2.4658 0.4812 0.7410 7.7959 3.0510 2.7528 20.7049 17.8161 2.5211 4.6899 1.8567 38.3805 9.5213 35.0453 1.2506 7.0763 2.0780 2.5602 2.2679 0.3233 6.6312 0.7317 4.3467 18.9121 1.6648 6.3255 1.1429 3.2062 12.0695 0.8581 2.2687 1.4405 45.7012 46.2650 6.2641 1.6813 17.6257 3.7364 1.3285 1.2924 1.6355 95.5457 0.7697 11.8721 1.1958 0.1395 5.6829 1.7885 2.4873 2.0528 13.4852 6.3375 0.9872 2.9592 5.2221 15.5573 11.8301 4.2802 3.6388 16.2336 82.3433 334.1076 140.4848 28.5481 50.8502 98.8161 41.8021 28.7027 32.5355 24.5521 94.5708 89.5014 67.1127 87.3649 79.0944 39.4189 37.5176 5.0942 10.0333 0.1812
temp: 298.150 k
press: 1.00000 atm
elementType: 6 6 6 6 1 1 6 7 6 1 6 6 6 6 1 1 6 1 1 6 1 1 1 1 1 1 6 1 1 1 6 1 6 7
symmnumber: 1
zpe: 757500.0 jmol-1
zpe.correction: 0.288517 hartree
zpe.thermalcorrener: 0.303930 hartree
zpe.thermalcorrenthalpy: 0.304874 hartree
zpe.thermalcorrgfe: 0.245515 hartree
zpe.sumelectzpe: -690.800213 hartree
zpe.sumelectthermal: -690.784800 hartree
zpe.sumelectthermalent: -690.783856 hartree
zpe.sumelectthermalfe: -690.843215 hartree
dipole: -6.0671 -9.5214 -0.6493
dipole: 11.3088
quadrupole: -122.2693 -110.4720 -102.6036
quadrupole: -22.3346 -2.5293 4.4186
quadrupole: -10.4876 1.3096 9.1780 -22.3346 -2.5293 4.4186
hfenergy: -691.0887296 hartree
pointgroup: C01 [X(C15H17N2)]
dipole: -1.5752186 -4.1449526 0.3654925 debye
polarizability: 259.8435278|9.7405754|294.7149018|32.0966621|-16.5609924|179.8080415 unknown
InChI: InChI=1/15C.2N.17H
charge 0 multiplicity 2
34 atoms
C  0.41513032 -1.53196293 -0.93917522
C  1.62516807 -1.76446373 -0.37155312
C  2.05450364 0.62365869 -0.20939804
C  0.83168974 0.90500792 -0.83348199
H  -0.16616529 -2.36410736 -1.32046074
H  2.00365445 -2.77681783 -0.27936504
C  2.96733563 1.6902704 0.0930802
N  3.70536553 2.54920246 0.34274129
C  -0.20810641 -0.1720493 -1.02364278
H  -0.65905319 -0.05203647 -2.01770445
C  -1.43789878 -0.04319031 -0.00529384
C  -2.16511553 1.29318954 -0.26900422
C  -2.40583049 -1.21387897 -0.29539307
C  -3.51706103 1.41029735 0.44286514
H  -2.33094858 1.39704 -1.3503693
H  -1.53145251 2.12986223 0.04211961
C  -3.76006353 -1.08503737 0.40912982
H  -2.57829037 -1.26401104 -1.37973836
H  -1.94158061 -2.16099711 -0.00156739
C  -4.43877914 0.24513402 0.08840463
H  -3.98007372 2.36430409 0.16756375
H  -3.36682496 1.43858864 1.52951948
H  -4.39680273 -1.92389837 0.10678376
H  -3.62635488 -1.17195091 1.49486668
H  -5.38876486 0.33001054 0.62768735
H  -4.67433691 0.2829774 -0.98432528
C  -0.92759349 -0.10320655 1.43830091
H  -0.37544187 -1.02926042 1.62687943
H  -0.26816142 0.74205753 1.66100612
H  -1.75673188 -0.06528676 2.14943683
C  2.43772131 -0.68899334 0.07805235
H  3.3853174 -0.87670309 0.5690128
C  0.59247383 2.21134252 -1.32339937
N  0.41195651 3.27876536 -1.7539349
