program: Gaussian 16
title: continue calc
version: ES64L-G16RevC.01
frameworkgroup: C1[X(C21H29N4)]
method: UwB97XD
basis: Gen
operation: Freq
keyword: #P
keyword: Geom=AllCheck
keyword: Guess=TCheck
keyword: SCRF=Check
keyword: GenChk
keyword: UwB97XD/ChkBas
keyword: Freq
converged: YES YES NO NO
polarizability: 3.82248468e+02 -5.71544497e+01 2.81725106e+02 1.03516547e+01 -1.41241015e+01 3.45154186e+02
1716.lowfreq: -0.0002 0.0008 0.0009 4.3574 11.5426 18.8995 24.5705 41.0755 42.2498
frequency: 24.2516 40.7401 41.9594 48.1045 53.3216 65.6443 75.5302 80.5238 94.7424 108.3496 114.3434 141.9685 168.3601 195.8623 214.7280 220.9995 263.7525 278.5834 325.5179 325.8500 331.9452 340.0984 350.5949 401.4258 410.7191 421.8450 428.7897 432.9626 458.3981 478.0192 496.1562 501.3384 526.5773 566.8809 582.9657 584.9476 601.4361 608.2495 651.1261 672.2422 692.2625 748.5532 758.2866 804.5534 814.2195 815.7471 822.8848 835.2280 854.8160 857.7507 859.9007 877.6516 887.2509 918.3907 919.1720 923.9065 935.1264 940.9314 961.5501 1001.2909 1001.6330 1014.0831 1018.8785 1028.0722 1038.2059 1051.7168 1053.0182 1053.9664 1067.1123 1101.5494 1106.4702 1108.9680 1109.9208 1136.0037 1147.6212 1190.8395 1202.2316 1211.3482 1212.7625 1215.3345 1222.1779 1254.7503 1264.4322 1275.1627 1278.3268 1279.5278 1295.6309 1302.8804 1321.8995 1323.4736 1335.6351 1351.1460 1352.2738 1357.8080 1368.1834 1369.2990 1371.0199 1383.9132 1385.4444 1393.8044 1404.0984 1405.5688 1408.7620 1412.3614 1429.8329 1431.2194 1453.8617 1457.0406 1471.7464 1485.2059 1488.9178 1490.1873 1495.8181 1496.4529 1497.2582 1502.7050 1504.2475 1506.1146 1507.2340 1510.3510 1517.5563 1525.7405 1555.0072 1636.8070 1679.0255 2374.6683 2376.5779 3043.0000 3043.9252 3062.1769 3064.1173 3067.1998 3071.0815 3101.7738 3104.9947 3108.5132 3109.4429 3110.9933 3111.1956 3114.4461 3124.1130 3130.6537 3132.3738 3136.1114 3146.2654 3164.6391 3167.1402 3167.6761 3169.3888 3200.2684 3202.0653 3206.6830 3244.3265 3257.2529 3270.0894 3493.3909
redmass: 3.5040 2.6581 3.5078 5.3361 5.2971 3.5854 3.5716 3.2322 4.4066 6.3179 8.5855 4.4468 4.6870 3.5553 1.4606 3.1780 4.1071 1.9001 2.6079 2.0788 2.0011 2.3929 2.4575 4.3235 2.2599 3.2809 2.4223 2.4136 3.9019 3.1236 4.2860 5.5587 2.2712 5.4803 3.5951 3.5826 4.4185 9.0155 5.0192 4.6995 3.5674 6.9237 3.8767 3.3848 1.5754 2.4241 4.3341 1.3494 1.2859 1.2894 1.9737 1.6825 1.5486 2.3709 1.9807 2.8608 3.2182 1.4858 1.5728 4.2933 1.5684 1.6873 2.1274 1.4181 2.4775 2.7286 2.7621 1.5983 1.9128 1.4558 2.6523 2.6571 2.0654 1.3592 3.0352 1.4793 2.0934 1.7853 1.8382 1.8917 1.0459 1.8784 2.0530 2.2073 1.0775 1.0879 1.0789 1.6776 1.2665 1.4625 1.5607 1.2732 1.2971 4.2582 1.3601 1.3577 1.3991 1.5306 1.5161 1.5102 1.4889 1.3649 1.4711 1.4397 1.3090 1.4355 1.4405 3.0704 1.3272 1.0791 1.0826 1.0944 1.0874 1.0862 1.0915 1.0804 1.0811 1.0848 1.0922 1.0882 1.0808 1.0990 2.7004 7.0323 6.1641 12.6798 12.6808 1.0631 1.0650 1.0613 1.0578 1.0517 1.0544 1.1009 1.0961 1.0602 1.0606 1.1022 1.0618 1.1045 1.1016 1.0606 1.0605 1.0607 1.1035 1.1011 1.1100 1.1099 1.1100 1.1104 1.1114 1.1109 1.0898 1.0969 1.0925 1.0793
irintensity: 1.5201 1.9878 4.3846 2.5558 11.1728 4.9775 6.5728 7.5130 3.9822 6.2339 3.8324 2.1495 2.6068 6.8928 0.5387 5.6929 1.7850 0.7796 0.5129 0.8555 0.7070 2.0036 0.9181 1.3378 0.2583 0.4630 0.3694 0.1811 0.0974 0.0478 2.4991 5.2905 4.6263 33.9954 0.6412 0.5773 1.3030 30.0948 1.2505 4.4020 5.5844 3.4889 4.1586 1.0005 8.6970 43.6884 8.0894 9.8132 20.4260 22.3598 1.3989 17.7700 39.0068 0.7961 2.0814 0.4270 10.3458 13.8312 1.7255 26.7321 6.5599 1.1685 4.1705 0.6820 0.5413 0.4081 0.1141 0.0883 2.3014 1.0513 49.1280 47.1187 12.3346 0.0626 13.1171 3.7286 0.8046 8.2708 11.8128 17.0735 0.3389 2.5304 17.8472 6.8580 3.4421 0.5257 6.9436 1.0460 0.5699 7.4158 0.1725 0.2148 0.4909 39.6425 7.6058 6.4488 0.7069 7.7207 8.0621 1.2499 0.1725 7.7689 0.4466 6.0948 8.7189 5.6725 52.3849 2.0307 53.0504 5.4871 1.9467 5.9345 6.0269 3.3911 13.2087 19.4071 12.0120 2.4847 9.7124 7.0950 3.6605 17.4565 25.6064 2.0556 72.1557 157.9978 178.6874 39.2617 80.6522 41.5828 24.6689 111.8795 9.2577 78.9928 87.5498 36.7805 37.1387 50.2677 43.5057 116.2417 96.2732 7.8732 13.1344 12.7826 40.2887 44.2622 11.5822 13.8336 14.5242 2.6894 13.0938 11.3976 1.2331 0.4377 1.8750 330.6190
temp: 298.150 k
press: 1.00000 atm
elementType: 6 6 6 6 6 1 1 1 6 6 7 7 6 1 6 6 6 6 1 1 6 1 1 6 1 1 1 1 1 1 6 1 1 1 7 6 1 1 6 1 1 7 6 1 1 6 1 1 6 1 1 6 1 1
symmnumber: 1
zpe: 1267237.2 jmol-1
zpe.correction: 0.482665 hartree
zpe.thermalcorrener: 0.505845 hartree
zpe.thermalcorrenthalpy: 0.506789 hartree
zpe.thermalcorrgfe: 0.428803 hartree
zpe.sumelectzpe: -1035.806154 hartree
zpe.sumelectthermal: -1035.782974 hartree
zpe.sumelectthermalent: -1035.782030 hartree
zpe.sumelectthermalfe: -1035.860016 hartree
dipole: -5.0712 10.1766 -3.9325
dipole: 12.0310
quadrupole: -159.9857 -157.8498 -142.3879
quadrupole: 28.2277 -4.6291 12.5307
quadrupole: -6.5779 -4.4420 11.0199 28.2277 -4.6291 12.5307
hfenergy: -1036.2888193 hartree
pointgroup: C01 [X(C21H29N4)]
dipole: -2.0466427 3.967687 -1.5726963 debye
polarizability: 383.6043491|-55.9894667|280.2275509|10.8251977|-13.188565|345.2958611 unknown
InChI: InChI=1/21C.4N.29H
charge 1 multiplicity 1
54 atoms
C  -0.54005989 -1.47077824 -1.6232895
C  0.74222046 -1.97878308 -1.77306167
C  1.46224639 -2.38909442 -0.65126816
C  0.8659035 -2.28904147 0.6174946
C  -0.42333093 -1.77007206 0.75311173
H  -1.07400092 -1.16523202 -2.51629048
H  1.19059289 -2.05597577 -2.75692026
H  -0.84130321 -1.70773543 1.74967079
C  2.79840231 -2.88558509 -0.79698186
C  1.584981 -2.69246667 1.79128548
N  2.16562165 -3.01204222 2.74248566
N  3.88236657 -3.27924827 -0.91744894
C  -1.14783523 -1.34183763 -0.36489888
H  0.43693939 0.58846551 0.16783672
C  -2.55767251 -0.75282001 -0.25775575
C  -2.97416302 -0.5502431 1.21519541
C  -2.57159693 0.6278701 -0.96597562
C  -4.29899688 0.20027075 1.37731509
H  -2.19381793 0.03079978 1.72591636
H  -3.0373968 -1.52070226 1.72132749
C  -3.89262983 1.38435414 -0.8047284
H  -1.76774543 1.24025837 -0.53659479
H  -2.34603662 0.50895284 -2.03079164
C  -4.2618297 1.55404454 0.66860701
H  -4.5001024 0.33556815 2.44558666
H  -5.12658665 -0.39954167 0.97926033
H  -3.80238407 2.36199377 -1.29093083
H  -4.69683105 0.84999879 -1.325621
H  -5.22725414 2.06270795 0.76487109
H  -3.5128021 2.19443402 1.15556643
C  -3.51794165 -1.73798827 -0.95361081
H  -3.25861122 -1.86520515 -2.00925221
H  -3.47527435 -2.71985195 -0.47077807
H  -4.55168139 -1.3871702 -0.90890971
N  1.09953608 1.36483223 0.09863542
C  1.17582964 1.80161674 -1.33215096
H  0.17905529 2.14493267 -1.61259797
H  1.43462751 0.92280063 -1.92339664
C  2.44202059 0.89609521 0.57190244
H  2.76089305 0.10817307 -0.11087209
H  2.30719064 0.47831623 1.57021055
N  2.71415235 3.27752558 -0.06237799
C  0.60275629 2.48304803 0.96397078
H  0.5917968 2.10855838 1.98808577
H  -0.41711322 2.70757298 0.64950821
C  3.38334943 2.12562154 0.54922634
H  3.67918104 2.39692073 1.56485669
H  4.28472515 1.89361784 -0.02161281
C  2.24633266 2.91896253 -1.40490195
H  3.10474281 2.58416499 -1.99125832
H  1.82777178 3.80680675 -1.88298267
C  1.57153037 3.67429396 0.76542151
H  1.0587117 4.50294355 0.27258186
H  1.93821471 4.02281065 1.73303955
