program: Gaussian 16
title: AWUYEX
version: ES64L-G16RevC.01
frameworkgroup: C1[X(C8H5NO2)]
method: RwB97XD
basis: Gen
operation: Freq
keyword: #P
keyword: Geom=AllCheck
keyword: Guess=TCheck
keyword: SCRF=Check
keyword: GenChk
keyword: RwB97XD/ChkBas
keyword: Freq
converged: YES YES YES YES
title: Mulliken charges:
elementType: C H C H C H C H C C C C O O N H
charge: -0.145963 0.190534 -0.140304 0.178403 -0.140303 0.178404 -0.145968 0.190533 -0.019448 -0.019453 0.656111 0.656114 -0.599051 -0.599031 -0.633258 0.392679
chargesum: -0.00000
title: Mulliken charges with hydrogens summed into heavy atoms:
elementType: C C C C C C C C O O N
charge: 0.044570 0.038099 0.038101 0.044566 -0.019448 -0.019453 0.656111 0.656114 -0.599051 -0.599031 -0.240578
chargesum: 0.00000
polarizability: 1.65362381e+02 3.95648897e-04 1.67920410e+02 1.24575344e-03 -4.48901630e-05 4.86926855e+01
1716.lowfreq: -15.2341 -0.0008 -0.0007 0.0004 13.5653 17.5409 135.7531 150.6781 186.1031
frequency: 135.7476 150.6621 186.1030 252.2537 350.5455 416.1655 469.2685 499.6408 539.1998 557.7835 656.4505 676.6557 688.6439 730.3967 765.3826 805.4082 813.5543 824.0555 924.7338 1001.5324 1042.2120 1050.2891 1081.5794 1119.8794 1176.6621 1200.4734 1207.5813 1323.0350 1348.3228 1385.0384 1422.2575 1520.1368 1520.8493 1693.9280 1695.9566 1812.8144 1868.8838 3230.8615 3238.7003 3245.6552 3251.7566 3645.3322
redmass: 4.9923 11.5170 5.4821 6.9121 11.5405 3.0529 4.8071 1.0892 7.4123 8.2415 11.8838 5.4083 4.8318 2.6232 5.8388 6.1527 1.7831 4.4450 1.3642 1.3922 1.3357 2.1193 3.5912 1.9925 1.4540 2.0200 2.1653 1.5667 8.0452 1.7725 6.3185 2.8159 2.6988 7.5703 7.3471 10.0884 12.9659 1.0881 1.0913 1.0958 1.0992 1.0817
irintensity: 0.0000 1.7259 4.0233 0.6860 30.0228 0.5632 0.0000 219.5048 19.0875 17.2144 21.9785 5.9034 0.0002 136.9135 4.9061 0.0000 13.4759 8.2159 0.0000 1.2744 0.0000 5.9926 116.5638 112.9367 1.4864 0.4757 54.8077 0.6068 429.2819 70.1542 204.6807 0.0533 19.1970 3.8868 35.2331 1677.9824 261.3201 0.5763 2.6876 5.5651 11.2542 259.4219
temp: 298.150 k
press: 1.00000 atm
elementType: 6 1 6 1 6 1 6 1 6 6 6 6 8 8 7 1
symmnumber: 1
zpe: 308196.2 jmol-1
zpe.correction: 0.117386 hartree
zpe.thermalcorrener: 0.125186 hartree
zpe.thermalcorrenthalpy: 0.126130 hartree
zpe.thermalcorrgfe: 0.084532 hartree
zpe.sumelectzpe: -512.839626 hartree
zpe.sumelectthermal: -512.831825 hartree
zpe.sumelectthermalent: -512.830881 hartree
zpe.sumelectthermalfe: -512.872480 hartree
dipole: 4.1578 -0.0003 0.0036
dipole: 4.1578
quadrupole: -49.6594 -74.2396 -62.7880
quadrupole: 0.0003 -0.0074 0.0000
quadrupole: 12.5696 -12.0106 -0.5590 0.0003 -0.0074 0.0000
hfenergy: -512.9570115 hartree
pointgroup: C01 [X(C8H5N1O2)]
dipole: -1.6357956 -0.0005192 0.0010714 debye
dipolederiv: -0.1714314 0.1333787 -0.0000661 -0.0943601 0.1727044 -0.0000154 -0.0001331 -0.0000876 -0.1014431 0.1341865 -0.0247189 -0.0000029 0.0095462 -0.0241167 0.000001 0.0000187 0.0000018 0.1664716 0.1627441 -0.1276638 0.0000972 -0.035902 -0.0859495 0.0000025 0.0001334 -0.0000559 -0.1227277 -0.0355774 0.0809375 -0.0000505 0.0832077 0.0756617 0.0000263 -0.0000707 0.000073 0.1573223 0.1626366 0.1278276 0.0000968 0.0360698 -0.0857735 -0.0000023 0.0001337 0.0000564 -0.1227205 -0.035452 -0.0810219 -0.0000503 -0.0832891 0.0755385 -0.0000262 -0.0000702 -0.0000734 0.1573216 -0.1714637 -0.133606 -0.0000656 0.0940967 0.1726671 0.0000146 -0.0001345 0.000087 -0.1014488 0.1341772 0.0248443 -0.000003 -0.0094264 -0.0241009 -0.0000005 0.0000179 -0.0000006 0.1664723 -0.5837083 0.3289806 -0.000024 0.3625812 -0.1413703 0.0000959 -0.0004773 -0.0000732 -0.0353277 -0.5832794 -0.3293475 -0.0000234 -0.3629146 -0.1419297 -0.0000955 -0.0004763 0.0000732 -0.035341 1.983696 -0.084756 0.0002081 -0.2734176 2.7934835 -0.0006603 0.0001664 -0.0003841 0.4876456 1.9835355 0.0841931 0.0002077 0.2728019 2.7937983 0.0006482 0.0001647 0.0003742 0.4876691 -1.0396939 0.5298723 -0.0001929 0.4821874 -1.8688654 0.0003712 0.0000248 -0.0003717 -0.4993829 -1.0389317 -0.5292585 -0.00019 -0.4815746 -1.8696343 -0.000364 0.000025 0.0003738 -0.499367 -1.3340814 0.0002603 0.0000731 0.0003019 -2.0590162 0.0000036 0.0009751 0.0000066 -0.541267 0.4326434 0.0000783 -0.0000142 0.0000918 0.2169031 0.0000008 -0.0002975 0.0000004 0.4361231 unknown
polarizability: 165.3623766|-0.0005714|167.9204101|0.022094|-0.0001701|48.6926897 unknown
InChI: InChI=1/8C.N.2O.5H
charge 0 multiplicity 1
16 atoms
C  -1.30929998 1.42220969 0.00012611
H  -1.30804546 2.50704107 0.00011467
C  -2.5053916 0.69799341 -0.00020819
H  -3.45109882 1.22996152 -0.00048812
C  -2.5048624 -0.69825191 -0.00020662
H  -3.45016847 -1.23093225 -0.00048504
C  -1.30821688 -1.42155756 0.00012935
H  -1.30612108 -2.50638692 0.00012167
C  -0.13060246 -0.69596099 0.00054321
C  -0.13112568 0.69751152 0.00054107
C  1.28737764 -1.15824934 0.00108822
C  1.28648881 1.16088891 0.00107925
O  1.72434771 -2.29144215 0.00061937
O  1.72261286 2.29439496 0.00061078
N  2.05634585 0.00159441 0.00030235
H  3.06906973 0.00194956 0.00094862
