program: Gaussian 16
title: Title Card Required
version: ES64L-G16RevC.01
frameworkgroup: C1[X(C8H4N2)]
method: RwB97XD
basis: Gen
operation: Freq
keyword: #P
keyword: Geom=AllCheck
keyword: Guess=TCheck
keyword: SCRF=Check
keyword: GenChk
keyword: RwB97XD/ChkBas
keyword: Freq
converged: YES YES YES YES
title: Mulliken charges:
elementType: C C C C C H H H C C N N C H
charge: -0.124012 -0.120221 0.067565 0.067545 -0.120218 0.194129 0.211327 0.211327 0.340040 0.340040 -0.568816 -0.568818 -0.124015 0.194128
chargesum: -0.00000
title: Mulliken charges with hydrogens summed into heavy atoms:
elementType: C C C C C C C N N C
charge: 0.070117 0.091106 0.067565 0.067545 0.091109 0.340040 0.340040 -0.568816 -0.568818 0.070113
polarizability: 1.89402424e+02 -5.55042916e-04 1.46010566e+02 2.33356443e-04 -4.75190487e-05 4.63069322e+01
1716.lowfreq: -32.3667 -29.7439 -25.7171 -0.0006 0.0004 0.0008 109.6168 111.9557 164.1060
frequency: 109.6131 111.9557 164.0413 195.1301 379.8266 397.1700 419.1823 485.4878 561.3044 578.2901 587.7503 628.0663 726.7248 748.0368 796.8715 824.2527 922.8715 1006.8620 1049.0339 1077.1505 1127.4128 1195.5633 1217.7199 1254.8781 1310.9788 1354.8102 1495.8695 1538.2717 1656.1427 1674.5344 2373.3966 2374.1932 3242.5447 3249.1260 3255.5187 3261.8867
redmass: 5.4642 13.3356 6.8191 7.2052 6.5454 3.5840 10.3392 10.2731 4.9668 9.3585 4.6116 7.4087 6.2038 4.5222 1.2735 6.4371 1.3564 1.3726 1.3443 2.2750 2.3649 1.0862 2.3952 2.8934 1.4878 8.9423 2.3700 2.7995 6.6402 6.1636 12.6833 12.6814 1.0888 1.0923 1.0964 1.1002
irintensity: 0.0000 4.7679 8.8819 14.3471 0.0000 1.4051 0.2505 4.1522 42.5315 1.0888 0.0000 2.7588 5.2631 0.0000 83.1755 2.1503 0.0000 3.0185 0.0000 2.7548 4.6403 0.1057 0.2225 22.6716 2.6226 29.6822 9.8054 13.0848 4.4091 20.3004 90.9864 211.8198 0.7571 1.1564 0.0017 3.8631
temp: 298.150 k
press: 1.00000 atm
elementType: 6 6 6 6 6 1 1 1 6 6 7 7 6 1
symmnumber: 1
zpe: 259305.4 jmol-1
zpe.correction: 0.098764 hartree
zpe.thermalcorrener: 0.106641 hartree
zpe.thermalcorrenthalpy: 0.107585 hartree
zpe.thermalcorrgfe: 0.065749 hartree
zpe.sumelectzpe: -416.496954 hartree
zpe.sumelectthermal: -416.489077 hartree
zpe.sumelectthermalent: -416.488133 hartree
zpe.sumelectthermalfe: -416.529969 hartree
dipole: 10.6838 -0.0000 0.0000
dipole: 10.6838
quadrupole: -66.1182 -59.8454 -57.6904
quadrupole: 0.0001 -0.0001 -0.0001
quadrupole: -4.9002 1.3726 3.5276 0.0001 -0.0001 -0.0001
hfenergy: -416.5957182 hartree
pointgroup: C01 [X(C8H4N2)]
dipole: -3.6368308 -2.1074952 0.0022175 debye
dipolederiv: 0.0729001 0.279694 -0.0004111 0.0686935 0.0189635 -0.0001723 -0.0000538 -0.000094 -0.0973003 -0.1735868 -0.3168459 0.0005099 -0.0215548 -0.0677299 -0.0000608 0.000004 -0.0001703 -0.0990227 -0.2611668 -0.0689669 -0.000009 0.1666691 0.3559161 -0.000415 -0.0004124 -0.0005093 0.074375 0.2455445 -0.1236453 0.0002769 -0.3593297 -0.1508007 0.0002458 0.0006733 0.0003336 0.0743738 -0.2398915 0.0164297 -0.0000827 -0.2788495 -0.0014322 -0.0002718 0.0004172 -0.0001601 -0.0990228 0.0755894 -0.0646325 0.0000777 -0.0752569 0.0063649 0.0002334 0.0000963 0.0002371 0.1604067 0.0911432 0.0590097 -0.0001325 0.050054 0.0520861 0.000229 -0.0001167 0.0002332 0.1754645 0.1087929 0.0399402 -0.0000936 0.0488973 0.0344419 0.0002589 -0.000107 0.0002534 0.1754641 1.0428139 -0.0729924 0.0004354 0.0189364 0.1369752 0.0001852 0.0002813 0.00015 0.2421322 0.3375528 0.4230527 -0.0006815 0.3311215 0.8422489 -0.0008894 -0.0005242 -0.0008526 0.242134 -0.5248021 -0.214448 0.0003352 -0.1784216 -0.8254849 0.0005544 0.0002768 0.0005461 -0.4560546 -0.9206246 0.0483668 -0.000265 0.0123907 -0.4296547 -0.0000401 -0.0002011 -0.0000264 -0.4560529 0.1826211 0.0058529 0.0000968 0.2168391 -0.0907187 0.0000718 -0.0002571 -0.0000082 -0.0973033 -0.0368862 -0.0108151 -0.0000566 -0.0001891 0.1188245 0.0000708 -0.0000767 0.0000676 0.1604062 unknown
polarizability: 178.4945354|18.823742|156.918139|0.0182316|-0.1813241|46.3072482 unknown
InChI: InChI=1/8C.2N.4H
charge 0 multiplicity 1
14 atoms
C  0.88335193 -2.01982335 1.00725102
C  2.27505592 -2.02831913 1.00779543
C  2.97173403 -0.82054317 1.00600885
C  2.26461776 0.39964213 1.0036618
C  0.87031526 0.39567607 1.00313421
H  0.34517663 -2.96112493 1.00865055
H  2.82361324 -2.96329877 1.00959486
H  0.33182701 1.33648803 1.00133383
C  4.40610913 -0.83059512 1.00658065
C  2.96905 1.64916332 1.00180783
N  3.53455271 2.66131736 1.00028237
N  5.56545838 -0.84329432 1.00703755
C  0.18575082 -0.81604672 1.00493649
H  -0.8985525 -0.81498312 1.00451873
