program: Gaussian 16
title: AWUYEX
version: ES64L-G16RevC.01
frameworkgroup: C1[X(C8H4NO2)]
method: RwB97XD
basis: Gen
operation: Freq
keyword: #P
keyword: Geom=AllCheck
keyword: Guess=TCheck
keyword: SCRF=Check
keyword: GenChk
keyword: RwB97XD/ChkBas
keyword: Freq
converged: YES YES YES YES
title: Mulliken charges:
elementType: C H C H C H C H C C N C C O O
charge: -0.175311 0.166467 -0.153161 0.159485 -0.153161 0.159485 -0.175313 0.166466 -0.015512 -0.015509 -0.763202 0.588534 0.588531 -0.688899 -0.688899
chargesum: -1.00000
title: Mulliken charges with hydrogens summed into heavy atoms:
elementType: C C C C C C N C C O O
charge: -0.008844 0.006324 0.006324 -0.008847 -0.015512 -0.015509 -0.763202 0.588534 0.588531 -0.688899 -0.688899
polarizability: 1.74940452e+02 -2.43223098e-04 1.85014392e+02 -4.08065537e-03 -8.98101213e-05 5.43432265e+01
1716.lowfreq: -0.0011 -0.0010 -0.0003 9.5584 18.4128 20.9574 126.4186 177.3871 202.8351
frequency: 126.3816 177.3826 202.8347 250.0521 364.0782 421.8448 472.9078 546.6103 568.3215 665.1389 695.3366 700.6770 738.3888 762.5219 813.2883 814.3232 853.6546 918.2588 988.4161 1028.1941 1046.6598 1102.2772 1165.7264 1168.1015 1192.2471 1245.7374 1317.1813 1327.6662 1408.4347 1512.2242 1516.9520 1676.9323 1696.1050 1699.2352 1793.8423 3216.1967 3223.5491 3230.8557 3239.3767
redmass: 5.0103 7.8296 9.6452 6.9052 11.0269 3.0093 4.9624 7.2255 9.2893 14.0968 4.8043 8.0443 2.2844 6.3322 6.5720 2.0240 8.2734 1.3589 1.4030 1.3130 2.1053 2.9082 2.1113 1.6235 1.7924 3.7434 1.8222 9.4044 6.7160 2.5913 2.7428 9.8888 7.8219 8.7507 12.7624 1.0868 1.0903 1.0951 1.0988
irintensity: 0.0000 7.2822 0.2542 0.6940 18.4710 0.4044 0.0000 31.6794 11.0167 3.5330 0.0000 1.3072 159.0044 0.3001 0.0000 5.2751 20.7927 0.0000 1.3045 0.0000 11.7496 1.6892 77.1915 0.3354 5.1687 435.4462 52.7545 525.2158 191.4299 2.9608 1.9385 1610.0481 12.8721 660.6198 99.3765 0.0000 3.2200 26.3509 27.2096
temp: 298.150 k
press: 1.00000 atm
elementType: 6 1 6 1 6 1 6 1 6 6 7 6 6 8 8
symmnumber: 1
zpe: 274470.7 jmol-1
zpe.correction: 0.104540 hartree
zpe.thermalcorrener: 0.111995 hartree
zpe.thermalcorrenthalpy: 0.112939 hartree
zpe.thermalcorrgfe: 0.071938 hartree
zpe.sumelectzpe: -512.364778 hartree
zpe.sumelectthermal: -512.357323 hartree
zpe.sumelectthermalent: -512.356379 hartree
zpe.sumelectthermalfe: -512.397380 hartree
dipole: -13.2844 -0.0001 -0.0010
dipole: 13.2844
quadrupole: -85.0823 -83.9029 -64.9801
quadrupole: 0.0000 -0.0043 -0.0001
quadrupole: -7.0939 -5.9145 13.0083 0.0000 -0.0043 -0.0001
hfenergy: -512.4693181 hartree
pointgroup: C01 [X(C8H4N1O2)]
dipole: -2.7846114 -0.9986824 -4.3086774 debye
dipolederiv: -0.0601883 0.0881011 0.0014962 0.1431689 0.079158 -0.04349 -0.0912729 -0.1621638 -0.0532115 0.1094361 -0.076451 0.018316 -0.0912203 0.0053526 0.0651317 0.0432234 0.0970089 0.0904811 -0.0371833 0.0993784 0.0858231 0.1017163 -0.0557003 0.0522155 0.0819304 0.0472477 -0.0579262 0.0278996 -0.1046586 -0.0945579 -0.1035242 0.0556632 -0.0578336 -0.0965116 -0.0602892 0.0474744 -0.1176297 0.0097017 0.0636001 0.007374 -0.1114407 -0.0570391 0.0675181 -0.0520927 0.0782567 0.1139664 -0.0050762 -0.0769138 -0.0062368 0.1152531 0.051265 -0.0750143 0.0537514 -0.0981818 -0.0721782 0.1294926 -0.0939286 0.0744177 0.070991 -0.1776407 -0.0011781 -0.0589445 -0.0330602 0.1109145 -0.0895436 0.0435303 -0.0747753 0.006318 0.0988959 0.0186301 0.067013 0.0880342 -0.2507699 -0.2260442 -0.181561 -0.1664443 -0.1612766 -0.06924 -0.281952 -0.1975154 -0.2636452 -0.0941697 0.012714 -0.2462792 -0.0469493 -0.0528052 0.0054975 -0.1460012 0.1338282 -0.5287271 -1.2434304 -0.7315656 0.0235323 -0.7315257 -1.9671938 0.5881894 0.0235942 0.5881518 -1.6208898 1.2566825 1.0395104 0.1521504 1.1129988 2.2128362 -0.7002431 0.0283924 -0.8584896 1.8778659 1.2391699 1.0927951 0.0241138 1.0192746 2.1999898 -0.8816356 0.1478246 -0.7233568 1.9082207 -1.1961896 -0.8764996 0.132246 -0.8305716 -1.8404099 0.3464397 0.055365 0.2481723 -0.8705771 -0.7863298 -0.3618545 0.1484323 -0.4077028 -1.5567355 0.7794874 0.225452 0.8776786 -1.564114 unknown
polarizability: 110.6601777|54.8879636|140.9186626|28.8091111|-27.5778368|162.7192308 unknown
InChI: InChI=1/8C.N.2O.4H
charge -1 multiplicity 1
15 atoms
C  2.84717333 1.10571287 6.71572888
H  2.40107679 0.24480001 7.2045701
C  2.50418417 1.44776151 5.40208343
H  1.78112853 0.84432971 4.86147463
C  3.07838127 2.55508867 4.77433068
H  2.79350794 2.79664901 3.75467847
C  4.01411444 3.35612612 5.43994974
H  4.46103245 4.2173887 4.95247758
C  4.34362284 3.00640747 6.73768525
C  3.77310506 1.90617602 7.36141359
N  5.25914759 2.8866197 8.90696645
C  5.28949826 3.61450162 7.74878306
C  4.37636767 1.85354145 8.74707747
O  5.97533767 4.61798148 7.53581536
O  4.09713517 0.99588462 9.58918996
