program: Gaussian 16
title: MARFEU
version: ES64L-G16RevC.01
frameworkgroup: C1[X(C6H12N2)]
method: UwB97XD
basis: Gen
operation: Freq
keyword: #P
keyword: Geom=AllCheck
keyword: Guess=TCheck
keyword: SCRF=Check
keyword: GenChk
keyword: UwB97XD/ChkBas
keyword: Freq
converged: YES YES NO YES
polarizability: 1.21542319e+02 3.67616974e-02 1.03003165e+02 1.17405201e-02 -1.87406923e-02 1.03019594e+02
1716.lowfreq: -42.3014 -39.9896 -37.6960 -0.0008 -0.0005 0.0010 53.6732 371.0172 373.9239
frequency: 52.2861 370.9811 373.8950 472.9195 474.3678 567.8128 568.1038 699.9290 705.0606 744.8752 745.0152 826.2543 850.9681 887.7295 888.7248 935.6953 956.6086 1041.9273 1061.5891 1062.6560 1104.5233 1104.9622 1172.1081 1172.3627 1199.6792 1201.3569 1257.9782 1258.1571 1316.1443 1316.8733 1327.9218 1358.8055 1395.5634 1397.9827 1398.7616 1400.2122 1494.0162 1496.7326 1503.2247 1505.9628 1523.0109 1536.5980 3131.2398 3133.0891 3134.5551 3136.6177 3138.3656 3141.1848 3204.6776 3207.1848 3208.3614 3220.4612 3223.5209 3224.9748
redmass: 1.8574 2.0082 2.0091 2.3531 2.3550 3.2524 3.2647 13.2732 4.7904 6.4561 6.4352 4.3429 1.1398 1.2295 1.2320 3.7491 3.9254 1.5392 2.0574 2.0540 2.0991 2.0953 1.3364 1.3345 1.0560 1.0278 1.0963 1.0951 1.2355 1.2353 1.2400 1.3521 1.7159 1.7139 2.2798 2.2875 1.1409 1.1354 1.1395 1.1372 1.1252 1.1202 1.0578 1.0573 1.0584 1.0580 1.0576 1.0597 1.1126 1.1132 1.1134 1.1127 1.1138 1.1140
irintensity: 0.0047 0.0021 0.0080 0.8590 0.7993 0.0176 0.0091 0.3846 869.4028 11.4130 11.3337 0.0002 0.0389 11.6298 12.2004 0.0003 69.2977 0.0006 2.5922 2.8503 0.0004 0.0002 0.0015 0.0005 0.0055 0.0009 57.1047 56.6686 0.0015 0.0011 0.0154 8.2704 32.5082 32.2286 0.1046 0.0109 0.0004 0.0010 3.6060 3.8119 1.2056 0.0533 4.0061 2.0662 33.7458 17.1928 18.8988 0.8851 0.0028 0.0217 0.0011 1.1646 5.4966 6.0204
temp: 298.150 k
press: 1.00000 atm
elementType: 7 6 1 1 6 1 1 7 6 1 1 6 1 1 6 1 1 6 1 1
symmnumber: 1
zpe: 489479.4 jmol-1
zpe.correction: 0.186433 hartree
zpe.thermalcorrener: 0.192704 hartree
zpe.thermalcorrenthalpy: 0.193648 hartree
zpe.thermalcorrgfe: 0.155196 hartree
zpe.sumelectzpe: -344.900162 hartree
zpe.sumelectthermal: -344.893891 hartree
zpe.sumelectthermalent: -344.892946 hartree
zpe.sumelectthermalfe: -344.931399 hartree
dipole: 0.0005 -0.0037 -0.0006
dipole: 0.0038
quadrupole: -47.0013 -35.4937 -35.5027
quadrupole: -0.0244 -0.0070 -0.0018
quadrupole: -7.6688 3.8389 3.8299 -0.0244 -0.0070 -0.0018
hfenergy: -345.0865944 hartree
pointgroup: C01 [X(C6H12N2)]
dipole: -0.0005433 0.0001567 -0.0013842 debye
dipolederiv: -1.320301 -0.6642986 0.5799094 -0.6668698 -0.5494028 0.3371936 0.58035 0.333552 -0.4551183 0.7984916 0.216122 0.0309218 0.2064804 0.1643688 0.0787249 0.0573758 0.0875025 -0.0188509 -0.0064372 0.0732033 -0.0410049 0.0630457 0.0631036 -0.0397506 0.0119613 -0.0436598 0.1109974 0.0623473 -0.0051405 -0.0683253 -0.0381606 0.0085631 -0.0921015 -0.0373398 -0.0571298 0.092936 0.1256333 0.3159779 -0.0883594 0.3474053 0.5867013 -0.2466894 -0.0988477 -0.2378074 0.2359359 0.1237615 -0.068078 -0.0483332 -0.0131277 -0.0112461 -0.0385498 -0.0510154 -0.0435013 0.0536482 0.1454024 -0.0157811 -0.017105 0.0199565 0.0463119 0.0245593 -0.041234 0.0648127 -0.0301619 -1.3207976 -0.6658714 0.5811926 -0.6619101 -0.5468895 0.3345319 0.5817434 0.3352649 -0.4562253 0.4434304 -0.019646 -0.3894622 -0.0336612 0.0162902 -0.0918991 -0.4094357 -0.107633 0.4831185 0.1100053 0.0546484 0.0052833 0.0373515 0.0891198 0.07255 -0.0096678 0.0201346 -0.0353563 0.0188562 0.1116907 0.037815 0.0780662 0.0854291 -0.0041291 -0.0040497 -0.0150369 0.0625594 0.7956108 -0.0029084 -0.2220795 -0.0325809 -0.0381505 0.0609539 -0.209413 0.04901 0.1903644 -0.0083899 0.0519274 -0.0679702 -0.0068362 0.1210087 -0.0360781 -0.0700608 -0.0304259 0.0486694 0.0630323 0.0669183 0.015309 0.0313095 0.1123392 -0.0418183 0.040422 -0.0759579 -0.0084576 0.1228684 0.1373991 -0.3028004 0.1481753 0.3073379 -0.2767878 -0.3272136 -0.2891629 0.5126393 0.1241085 0.037685 0.0751673 0.0491802 0.0626618 -0.0358728 0.0197423 -0.0279126 -0.0234267 0.1472151 0.0126792 0.0180967 0.0415993 -0.0347211 0.0494594 -0.0139383 0.016325 0.0555237 0.4478186 0.384425 0.0728575 0.3980026 0.497817 -0.0401167 0.0912299 -0.0218541 -0.0031537 0.1108938 0.0005577 -0.0552018 0.0145775 -0.0461281 0.0010065 -0.0353918 0.0501045 0.1015567 0.0164503 -0.02151 -0.115911 0.0179964 0.0654857 -0.0151865 -0.0752173 -0.0066246 0.082802 unknown
polarizability: 114.7016405|6.7369683|106.8986896|-5.891022|-3.3706086|105.9647482 unknown
InChI: InChI=1/6C.2N.12H
charge 1 multiplicity 2
20 atoms
N  2.48641219 11.28904083 -0.47167051
C  2.08764085 11.74402994 -1.76984978
H  1.26974477 12.45948755 -1.68863756
H  1.80799133 10.89999601 -2.39994543
C  3.5306418 10.31148903 -0.53921474
H  3.23650135 9.48324419 -1.18349246
H  3.78781611 9.95840803 0.45917438
N  4.42935217 12.40776763 -1.44821153
C  2.817581 12.3727646 0.40373298
H  3.08379489 11.99692961 1.39139742
H  1.99156989 13.08103509 0.46395973
C  4.8233914 11.05602982 -1.18763867
H  5.64478074 11.02966884 -0.47195563
H  5.0959187 10.55252804 -2.11491397
C  3.38007884 12.4868213 -2.41973712
H  3.66717718 11.96734861 -3.33368941
H  3.1268547 13.52683841 -2.62386786
C  4.10919693 13.11784084 -0.24653908
H  3.84730217 14.15128561 -0.47234793
H  4.93955301 13.06914601 0.45754716
