program: Gaussian 16
title: MARFEU
version: ES64L-G16RevC.01
frameworkgroup: C1[X(C6H12N2)]
method: RwB97XD
basis: Gen
operation: Freq
keyword: #P
keyword: Geom=AllCheck
keyword: Guess=TCheck
keyword: SCRF=Check
keyword: GenChk
keyword: RwB97XD/ChkBas
keyword: Freq
converged: YES YES YES YES
title: Mulliken charges:
elementType: N C H H C H H N C H H C H H C H H C H H
charge: -0.529390 -0.110558 0.143545 0.143515 -0.110828 0.143596 0.143634 -0.529389 -0.110679 0.143590 0.143580 -0.110834 0.143635 0.143589 -0.110559 0.143513 0.143546 -0.110674 0.143580 0.143589
chargesum: -0.00000
title: Mulliken charges with hydrogens summed into heavy atoms:
elementType: N C C N C C C C
charge: -0.529390 0.176501 0.176402 -0.529389 0.176491 0.176390 0.176500 0.176495
polarizability: 1.00095329e+02 4.37490465e-04 1.05655069e+02 4.69031898e-03 2.74837913e-02 1.05634134e+02
1716.lowfreq: -24.1798 -18.9023 -0.0011 -0.0009 -0.0007 5.0204 42.1571 338.6662 339.6872
frequency: 41.8107 338.6642 339.6867 434.6840 435.4415 596.9399 597.3436 601.4845 795.2825 821.5599 831.7461 843.7486 844.3638 925.6881 926.0348 1000.7885 1003.7295 1036.1181 1067.0809 1067.5881 1118.4737 1118.9792 1213.8953 1218.1384 1218.3315 1277.1801 1339.7806 1340.7869 1352.3217 1353.0742 1371.5251 1371.6098 1372.1269 1372.7322 1389.5900 1401.2833 1487.9994 1488.5705 1496.7268 1497.2695 1497.5068 1502.1387 3067.5850 3068.1451 3068.6922 3075.1116 3075.7234 3081.7037 3118.0597 3118.7609 3119.1842 3135.7152 3137.2825 3137.7215
redmass: 1.6979 1.7129 1.7127 2.3196 2.3191 3.6237 3.6110 11.5875 3.9050 1.1608 5.0401 1.2618 1.2615 3.3571 3.3574 2.7348 5.2932 1.5358 2.6192 2.6154 2.6679 2.6702 1.0404 1.9559 1.9560 1.0893 1.2240 1.2193 1.2471 1.2444 1.5274 1.5894 1.5831 1.5216 1.4021 1.3461 1.0813 1.0813 1.0850 1.0851 1.1039 1.0975 1.0596 1.0596 1.0598 1.0602 1.0602 1.0631 1.1080 1.1079 1.1081 1.1085 1.1087 1.1086
irintensity: 0.0003 0.0006 0.0000 1.1397 1.1520 0.0015 0.0011 0.0011 150.1014 0.0028 0.0203 15.1876 14.8799 6.1508 6.1181 0.0005 25.7380 0.0000 0.0008 0.0006 64.5453 64.5709 0.0004 0.0002 0.0000 0.0000 0.0010 0.0003 3.5441 4.7986 0.1712 24.3204 25.7084 0.0162 0.0689 14.8603 0.0024 0.0085 7.2520 7.4212 10.1770 0.0642 39.5183 46.8304 65.9707 166.2494 170.6043 0.6903 0.0058 0.0263 0.0027 15.0792 136.9114 150.5682
temp: 298.150 k
press: 1.00000 atm
elementType: 7 6 1 1 6 1 1 7 6 1 1 6 1 1 6 1 1 6 1 1
symmnumber: 1
zpe: 487798.3 jmol-1
zpe.correction: 0.185793 hartree
zpe.thermalcorrener: 0.192096 hartree
zpe.thermalcorrenthalpy: 0.193040 hartree
zpe.thermalcorrgfe: 0.154939 hartree
zpe.sumelectzpe: -345.072781 hartree
zpe.sumelectthermal: -345.066478 hartree
zpe.sumelectthermalent: -345.065533 hartree
zpe.sumelectthermalfe: -345.103635 hartree
dipole: -0.0001 -0.0022 -0.0007
dipole: 0.0023
quadrupole: -60.6970 -44.8584 -44.8555
quadrupole: 0.0004 0.0124 0.0015
quadrupole: -10.5600 5.2786 5.2814 0.0004 0.0124 0.0015
hfenergy: -345.2585735 hartree
pointgroup: C01 [X(C6H12N2)]
dipole: -0.0005647 0.0005197 -0.0004661 debye
dipolederiv: -0.890017 -0.1106794 0.0948593 -0.1109276 -0.7617892 0.0545848 0.0947094 0.0544614 -0.7443689 0.3785594 0.005293 0.0834667 0.0355179 0.2880392 -0.051933 0.0208407 -0.0757364 0.430427 -0.1480059 0.1128457 -0.0000164 0.152333 -0.0473627 0.0272562 0.0464904 -0.0008479 0.0479591 0.0160929 -0.0668147 -0.035613 -0.1210312 -0.1085156 -0.1346732 -0.0546225 -0.0956758 -0.0562167 0.3985984 -0.0273582 -0.0422968 -0.094539 0.4250214 -0.0198242 -0.0223293 -0.0413524 0.2679163 0.006195 -0.0910674 -0.0247962 -0.0543638 -0.1398405 -0.0967745 -0.0246891 -0.1540872 -0.0137819 0.0152255 0.0241301 -0.0346496 0.0169449 0.0146641 0.0837484 -0.0433008 0.1504028 -0.1765175 -0.8879136 -0.1094709 0.0974831 -0.1093192 -0.7608345 0.0558772 0.0974877 0.0560106 -0.7476366 0.3255441 0.032776 -0.0521649 0.0697498 0.3776889 0.0691517 -0.007826 0.1111732 0.3876416 0.0356777 -0.0078627 -0.0585069 -0.012972 0.0231664 0.1151025 -0.0237784 0.0583668 -0.2041848 -0.1377061 0.1292431 0.0690583 0.1173125 -0.0719939 -0.0459889 0.0134658 -0.0075386 0.061989 0.375706 -0.0828786 -0.0184274 -0.0161774 0.445703 -0.0521369 -0.0389664 -0.0296274 0.2700345 -0.1495015 0.017611 -0.1106959 -0.022949 0.0425169 0.0123902 -0.156723 0.040717 -0.0396582 0.0172018 0.0248608 0.070637 0.0362678 -0.0244708 -0.0841707 0.1256656 -0.1225905 -0.1401642 0.4008566 0.0364134 0.0312245 0.0080893 0.2828756 -0.0618043 0.0960271 -0.0416898 0.4131959 0.0065549 0.0112353 0.0929857 0.0164696 0.0187482 -0.1324841 0.0558632 -0.0740167 -0.1739071 0.0147572 0.0372226 -0.018131 0.0451426 -0.2066345 0.1178341 -0.0103136 0.0516068 0.0444713 0.3245394 0.0555297 -0.0246841 0.0198828 0.362427 0.1097657 -0.0674635 0.0651771 0.404061 0.035414 0.0573963 0.0164445 0.020827 -0.2263459 0.0222674 0.016443 0.0803485 0.0432362 -0.1377787 -0.0484251 -0.136177 0.0037419 0.0669371 0.0118115 -0.1169802 -0.0251014 -0.0744961 unknown
polarizability: 102.151368|-2.0327863|104.4927564|1.7611288|0.9953926|104.740408 unknown
InChI: InChI=1/6C.2N.12H
charge 0 multiplicity 1
20 atoms
N  2.43870819 11.26100045 -0.4475042
C  2.11109504 11.76142998 -1.79127957
H  1.26183128 12.44656559 -1.70319972
H  1.7933773 10.91191536 -2.40430032
C  3.56406368 10.3196632 -0.55222378
H  3.24455359 9.47178831 -1.16658255
H  3.78707583 9.94095537 0.45043347
N  4.47758793 12.43521311 -1.47212668
C  2.84518136 12.39536051 0.39592596
H  3.0690184 12.01374716 1.3972633
H  1.99505713 13.07980488 0.48112211
C  4.80016802 11.03154095 -1.17349485
H  5.65322603 11.01551468 -0.48756196
H  5.11050547 10.54655379 -2.10456888
C  3.34718287 12.47326594 -2.41249008
H  3.65932512 11.98636087 -3.34195843
H  3.12780663 13.52113783 -2.64107812
C  4.08129458 13.10719912 -0.22523822
H  3.86094066 14.15430334 -0.45644161
H  4.9353009 13.08837956 0.45940412
