program: Gaussian 16
title: AWUYEX
version: ES64L-G16RevC.01
frameworkgroup: C1[X(C22H29N3O4)]
method: RwB97XD
basis: Gen
operation: Freq
keyword: #PGeom=AllCheck
keyword: Guess=TCheck
keyword: SCRF=Check
keyword: GenChk
keyword: RwB97XD/ChkBas
keyword: Freq
converged: YES YES NO YES
title: Mulliken charges:
elementType: C H C H C H C H C C N C C O O O C O C H H H C C C C H H C H H C H H H H H H N C H H C H H N C H H C H H C H H C H H
charge: -0.150250 0.192316 -0.141997 0.177706 -0.139277 0.178197 -0.151001 0.190511 -0.000012 -0.020334 -0.433100 0.647597 0.607412 -0.584290 -0.595774 -0.074392 0.658454 -0.514957 -0.374836 0.147732 0.153708 0.147154 -0.094016 -0.214660 -0.205024 -0.238591 0.136192 0.150525 -0.240144 0.135365 0.136488 -0.228576 0.128475 0.122913 0.126640 0.121533 0.122306 0.116768 -0.511062 -0.107596 0.144066 0.143897 -0.107997 0.144411 0.144708 -0.642484 -0.108012 0.142854 0.143393 -0.107341 0.152000 0.151452 -0.092090 0.152531 0.155327 -0.100469 0.154612 0.151042
chargesum: -0.00000
title: Mulliken charges with hydrogens summed into heavy atoms:
elementType: C C C C C C N C C O O O C O C C C C C C C N C C N C C C C
charge: 0.042066 0.035709 0.038919 0.039510 -0.000012 -0.020334 -0.433100 0.647597 0.607412 -0.584290 -0.595774 -0.074392 0.658454 -0.514957 0.073758 -0.094016 0.072056 0.066828 0.012797 0.008029 0.010499 -0.511062 0.180366 0.181121 -0.642484 0.178235 0.196111 0.215769 0.205185
polarizability: 4.06659544e+02 -3.81275610e+01 3.19097957e+02 4.88977476e+00 1.81683066e+01 3.73710079e+02
1716.lowfreq: -7.8460 -5.7951 -0.0011 0.0004 0.0006 7.1966 11.6631 16.6545 19.3562
frequency: 11.3880 16.5634 19.1849 27.0863 37.0297 52.2876 55.8491 59.9018 67.9984 80.1359 89.9504 120.7704 131.3736 146.9381 158.5795 185.9096 201.1612 226.5508 235.2526 250.3104 264.0283 324.1658 341.8504 343.8254 344.9559 346.5134 365.6557 374.9521 402.8703 414.2003 436.4890 438.6700 447.3442 469.3330 472.2283 519.2553 532.1918 550.2501 597.6317 598.4174 618.0843 623.4268 674.4531 676.8281 708.8347 722.8237 730.0460 766.6744 792.1545 800.3625 805.5724 806.2803 815.5428 823.0056 838.4069 843.8408 848.0734 853.2480 872.5447 903.7946 907.2159 922.5562 923.6056 926.9745 928.4538 957.5381 997.5859 997.8894 1002.5281 1006.6540 1007.1629 1016.6464 1022.1228 1037.6634 1038.1657 1053.3161 1063.6418 1069.6357 1069.9503 1093.3588 1103.6111 1110.0163 1119.7690 1120.0756 1130.5715 1185.5241 1189.6960 1189.9814 1196.7843 1201.2359 1211.4629 1219.0626 1221.1325 1234.9443 1240.8206 1270.2355 1276.4375 1300.1871 1315.3458 1325.6742 1330.9688 1338.0907 1340.2559 1349.8888 1350.2449 1365.8951 1369.9467 1371.2497 1373.0734 1374.5827 1386.5591 1386.8927 1400.1224 1400.2618 1401.8625 1405.5080 1407.1503 1427.9243 1449.5064 1482.2315 1484.9771 1486.0815 1487.7770 1490.3932 1493.6179 1494.6499 1496.0650 1498.4359 1502.7522 1504.4944 1507.4506 1510.4045 1518.4300 1520.6644 1690.9638 1698.5224 1820.2042 1863.2461 1889.6799 3048.0000 3055.1528 3063.9752 3064.9606 3065.8551 3066.5349 3069.7408 3070.5649 3073.1554 3074.2241 3076.4465 3082.3063 3108.0141 3112.7114 3116.0366 3116.5090 3117.9539 3121.4609 3125.0271 3127.9912 3134.8071 3137.1096 3140.2088 3152.1081 3173.5944 3229.7098 3238.6581 3246.2138 3251.2566
redmass: 4.6000 3.3346 3.4165 4.8392 5.1135 5.9152 3.5556 2.7031 3.9350 4.0421 5.5163 5.0051 3.8221 5.5811 6.4897 1.2574 7.0364 3.6264 2.8112 5.8935 2.0650 2.3817 1.8291 5.1269 1.8090 5.6992 4.0038 4.2218 2.0324 3.1983 2.3241 2.3346 3.8048 3.0758 4.8603 1.8041 7.4406 6.3124 3.5952 3.6147 9.4146 11.3267 4.2587 3.4268 3.6126 7.2713 6.2415 6.8863 2.8532 3.9750 1.9833 1.6379 3.3876 1.1675 5.0047 1.2568 1.2585 1.9677 1.9655 7.8828 3.2565 1.3801 2.0760 3.3293 3.3661 1.5624 1.4356 2.6766 1.8883 4.8631 1.7193 2.4511 3.0020 1.5253 1.3398 1.9841 2.0028 2.5861 2.5713 2.2654 1.7094 2.3465 2.6263 2.6074 1.3630 1.1238 1.5531 5.9819 2.5498 2.1314 1.0518 1.9235 1.8967 2.5898 4.2808 1.9701 1.0907 1.4304 1.2779 1.5681 1.4446 1.2295 1.2212 1.2416 1.2457 1.3804 1.5877 1.5623 1.5967 1.5734 1.4810 1.3984 1.4061 1.4520 1.5291 3.3018 2.0366 1.2372 10.3430 1.0805 1.0738 1.0826 1.0810 1.0942 1.0886 1.0875 1.0855 1.1004 1.0968 1.0803 1.0666 1.1003 2.8093 2.7088 7.4119 7.3993 13.0542 13.0631 12.9729 1.0653 1.0666 1.0624 1.0622 1.0590 1.0599 1.0518 1.0597 1.0508 1.0600 1.0602 1.0624 1.0970 1.1017 1.1030 1.1080 1.1079 1.1079 1.1043 1.0998 1.1085 1.1086 1.1083 1.1033 1.1016 1.0882 1.0915 1.0957 1.0991
irintensity: 0.6550 0.8235 0.2383 2.0888 0.7000 0.4677 4.8043 2.1537 0.0239 0.9857 0.2290 0.4398 3.0350 0.5338 1.0711 0.3331 10.1188 7.0688 6.3598 2.6615 4.4720 1.3099 0.8902 7.7262 0.1019 2.2498 4.8615 13.0377 1.5181 0.1567 0.9052 0.6578 5.1892 1.1670 5.4750 5.4283 18.5877 17.2395 0.0141 0.0350 26.4638 1.7366 63.3910 8.6886 203.3639 9.4427 8.3347 8.8376 5.0322 118.5110 8.1028 20.4874 2.7308 0.3178 1.8784 15.7087 17.0231 0.4069 11.9029 80.4278 23.7002 0.8743 2.5281 4.4248 3.0522 1.6304 1.0308 0.4668 7.4775 24.4349 2.9836 13.5120 17.2215 0.0843 0.0344 54.7149 54.5665 0.2957 0.1005 372.5013 185.1101 29.2580 58.5338 59.6603 0.0847 15.4827 23.0630 136.6777 31.0889 73.3809 0.1841 0.1559 0.4134 118.0478 253.1535 8.7724 0.0148 24.8612 4.7197 6.6400 2.3942 1.9078 0.2519 7.6132 9.5582 0.5823 23.4977 18.7359 14.3517 4.4412 0.7595 5.7188 9.9286 5.0464 0.0038 3.8614 3.8780 8.2665 217.3908 1.4339 4.1710 1.0803 0.2954 4.7806 12.7888 7.3007 5.4493 12.0575 1.5254 26.0677 5.7346 4.7619 0.8467 22.9884 3.7115 19.1247 1374.2703 371.6291 221.8563 56.0632 46.4930 39.1995 43.7620 13.7337 90.8808 34.7869 84.8920 18.4704 145.2581 133.8327 17.2513 83.8810 77.8079 81.9234 1.5290 2.0209 2.5694 62.1618 66.5623 52.8153 112.1845 117.1797 33.2287 30.0888 0.8266 3.2836 4.6193 10.4360
temp: 298.150 k
press: 1.00000 atm
elementType: 6 1 6 1 6 1 6 1 6 6 7 6 6 8 8 8 6 8 6 1 1 1 6 6 6 6 1 1 6 1 1 6 1 1 1 1 1 1 7 6 1 1 6 1 1 7 6 1 1 6 1 1 6 1 1 6 1 1
symmnumber: 1
zpe: 1307635.6 jmol-1
zpe.correction: 0.498052 hartree
zpe.thermalcorrener: 0.524397 hartree
zpe.thermalcorrenthalpy: 0.525341 hartree
zpe.thermalcorrgfe: 0.437049 hartree
zpe.sumelectzpe: -1320.115248 hartree
zpe.sumelectthermal: -1320.088903 hartree
zpe.sumelectthermalent: -1320.087959 hartree
zpe.sumelectthermalfe: -1320.176251 hartree
dipole: 3.6476 1.6719 -0.1642
dipole: 4.0159
quadrupole: -129.4659 -183.2338 -176.2458
quadrupole: -26.1422 -0.5940 4.0646
quadrupole: 33.5159 -20.2519 -13.2640 -26.1422 -0.5940 4.0646
hfenergy: -1320.6132999 hartree
pointgroup: C01 [X(C22H29N3O4)]
dipole: -1.4878235 0.5260417 -0.0770348 debye
polarizability: 399.1385355|45.8845809|321.5068987|-2.9865379|-5.3398219|378.8221459 unknown
InChI: InChI=1/22C.3N.4O.29H
charge 0 multiplicity 1
58 atoms
C  -2.2552702 -2.10150222 1.94447435
H  -2.1368041 -2.0432131 3.02118597
C  -3.42345745 -2.61214323 1.3697953
H  -4.22765534 -2.95652319 2.01153332
C  -3.57232 -2.68580172 -0.01567155
H  -4.49090259 -3.08633846 -0.43193765
C  -2.56064121 -2.24929508 -0.87761055
H  -2.67809205 -2.29979726 -1.95473082
C  -1.41390868 -1.7377153 -0.30081812
C  -1.26136003 -1.66976883 1.0850893
N  0.64553085 -0.87120022 0.14007629
C  -0.19985718 -1.16730098 -0.94344079
C  0.05733149 -1.05284575 1.39133325
O  0.10050031 -1.04696046 -2.10846983
O  0.56361648 -0.75659428 2.45181117
O  1.71584673 -0.04534369 -0.02116366
C  2.9304943 -0.70270385 -0.13491438
O  3.01380374 -1.89840008 -0.0550099
C  3.7694516 0.92619099 -1.77357129
H  3.72271745 0.14665976 -2.54111009
H  2.82902932 1.48404022 -1.78755973
H  4.57315436 1.61376398 -2.04487827
C  4.03338806 0.31027872 -0.38360067
C  3.98728109 1.38960137 0.72942299
C  5.3858603 -0.42875098 -0.34426292
C  5.18991181 2.3350374 0.67156744
H  3.97937518 0.88518617 1.70480743
H  3.0565327 1.95980948 0.65312733
C  6.58208511 0.52534637 -0.39474413
H  5.43836496 -1.00855383 0.58505365
H  5.43534577 -1.14560962 -1.17055042
C  6.51176753 1.56802611 0.72205056
H  5.12492254 3.03981829 1.50742823
H  5.14875782 2.93448905 -0.24645956
H  7.50447599 -0.05939206 -0.3116561
H  6.62197887 1.03254806 -1.36674841
H  7.35605001 2.26205706 0.64779629
H  6.59733651 1.06196567 1.69355404
N  -2.31472927 3.68033928 -0.5650969
C  -3.35176674 2.72784951 -0.9900783
H  -3.67555266 3.0036825 -1.99872823
H  -4.21130415 2.83515643 -0.32078906
C  -1.87492546 3.32920134 0.79311655
H  -2.73495436 3.41687513 1.4645104
H  -1.12441595 4.05954207 1.11153657
N  -1.38495424 1.29808578 -0.53366544
C  -1.16780439 3.57360071 -1.47981788
H  -0.40734214 4.29280906 -1.15917674
H  -1.50088023 3.86233149 -2.48180804
C  -1.29460374 1.8842846 0.80775942
H  -0.24209376 1.88287407 1.11040755
H  -1.84636015 1.24195296 1.50286699
C  -2.78901257 1.27726377 -0.95528858
H  -3.3465426 0.64819017 -0.25309031
H  -2.84354033 0.80266437 -1.94076491
C  -0.60917152 2.12102029 -1.4673378
H  -0.66721562 1.65876739 -2.4576059
H  0.438622 2.09692574 -1.15086111
