program: Orca
programVersion: 5.0.4
elementType: Cu C N N C C C C C C C C C C N H H H H H H H C C C H H C N C H H H C H C H H H C C H C C H C C H H O C H H C H H C H H C H H O C H H C H H C H H C H H O C H H C H H C H H C H H O C H H C H H C H H C H H O C H H C H H C H H C H H O C H H C H H C H H C H H O C H H C H H C H H C H H O C H H C H H C H H C H H O C H H C H H C H H C H H O C H H C H H C H H C H H
charge: 1
multiplicity: 1
keywords: wB97X-D4 def2-TZVP def2-TZVP/C VeryTightSCF
formula: C64H100CuN4O10
InChI: InChI=1/C15H11N3.C8H9.10C4H8O.CN.Cu/c1-3-10-16-12(6-1)14-8-5-9-15(18-14)13-7-2-4-11-17-13;1-2-8-6-4-3-5-7-8;10*1-2-4-5-3-1;1-2;/h1-11H;2-7H,1H3;10*1-4H2;;/q-3;;;;;;;;;;;;;+3/rC16H11CuN4.C8H9.10C4H8O/c18-12-17-19-10-3-1-6-13(19)15-8-5-9-16(21(15)17)14-7-2-4-11-20(14)17;1-2-8-6-4-3-5-7-8;10*1-2-4-5-3-1/h1-11H;2-7H,1H3;10*1-4H2
179 atoms
Cu 0.000002 -0.000001 -0.000002
C  -1.496371 0.019921 -1.23263
N  0.4055 1.98644 0.285582
N  2.016889 0.0000 0.000003
C  -0.511862 2.954696 0.293977
C  -0.17352 4.29126 0.196421
C  1.16373 4.63301 0.068549
C  2.118311 3.63222 0.048482
C  1.71713 2.30934 0.163179
C  2.634721 1.16661 0.193077
C  3.99133 1.20293 0.485551
C  4.66708 -0.00316 0.60825
C  3.98508 -1.20502 0.501551
C  2.627551 -1.16652 0.207638
N  -2.43984 0.02566 -1.91934
H  -1.540297 2.637422 0.382842
H  -0.94857 5.04262 0.21825
H  1.4603 5.66785 -0.02433
H  3.16401 3.87335 -0.066551
H  4.50682 2.13835 0.63973
H  4.493899 -2.14031 0.676129
H  5.72195 -0.00459 0.841169
C  1.15301 -4.63264 0.19204
C  -0.18759 -4.28545 0.22387
C  -0.526841 -2.945253 0.228728
H  1.45228 -5.67073 0.17697
H  -0.96497 -5.03456 0.23954
C  2.10943 -3.63364 0.16539
N  0.39137 -1.980029 0.229472
C  1.70634 -2.30653 0.186629
H  3.15851 -3.88152 0.12058
H  -1.557829 -2.624237 0.236772
H  -2.15883 0.636582 1.74974
C  -1.750731 -0.133291 2.398349
H  -2.08056 -1.110791 2.05866
C  -0.295069 -0.00688 2.54583
H  -2.20498 0.02488 3.38629
H  0.109119 0.994181 2.51265
H  -0.89255 -2.584808 3.19814
C  0.56769 -0.99239 3.05953
C  0.13767 -2.306712 3.35609
H  2.256922 0.344449 3.06298
C  1.921148 -0.656979 3.2926
C  1.02553 -3.23064 3.85315
H  0.69063 -4.23333 4.07825
C  2.801461 -1.590611 3.789976
C  2.35938 -2.88083 4.065461
H  3.834929 -1.324239 3.959203
H  3.05201 -3.61645 4.45051
O  0.999582 2.922205 3.189031
C  -0.11287 3.336858 3.980471
H  -0.350692 2.544184 4.70105
H  -0.968929 3.488054 3.316422
C  0.313652 4.60714 4.712241
H  -0.200952 4.719787 5.662587
H  0.128712 5.487734 4.095845
C  1.815077 4.374268 4.867117
H  2.381265 5.291811 5.004882
H  2.004548 3.704516 5.70599
C  2.14941 3.67957 3.549496
H  2.34296 4.421057 2.76126
H  3.004531 3.00312 3.61407
O  4.397286 -0.661011 -2.374786
C  3.353121 -1.163527 -3.18876
H  3.398925 -0.690248 -4.17993
H  2.40745 -0.889538 -2.716898
C  3.552157 -2.688316 -3.300944
H  3.592087 -2.986106 -4.347236
H  2.735407 -3.225169 -2.82328
C  4.897701 -2.933738 -2.60476
H  4.747755 -3.309731 -1.594281
H  5.531608 -3.628728 -3.148069
C  5.500593 -1.528444 -2.551284
H  6.184892 -1.370152 -1.718361
H  6.015856 -1.290817 -3.492949
O  -3.580987 -2.73834 1.186113
C  -4.416504 -1.920211 0.385028
H  -5.094977 -2.55438 -0.203457
H  -3.782102 -1.348613 -0.292597
C  -5.211175 -1.040073 1.364199
H  -6.237959 -0.91783 1.027191
H  -4.750168 -0.058348 1.445417
C  -5.125623 -1.807369 2.69549
H  -4.576094 -1.233725 3.439434
H  -6.104351 -2.048013 3.101028
C  -4.353549 -3.080686 2.319395
H  -3.674534 -3.431939 3.096924
H  -5.051318 -3.891047 2.062312
O  0.663147 3.203959 -2.794765
C  0.655003 1.900063 -3.369649
H  0.612948 1.17304 -2.547751
H  1.585701 1.745591 -3.926122
C  -0.582168 1.795017 -4.267431
H  -1.052456 0.81828 -4.18772
H  -0.316327 1.983079 -5.30758
C  -1.471029 2.915107 -3.730763
H  -2.170273 3.298368 -4.468523
H  -2.019775 2.560285 -2.858283
C  -0.427649 3.94766 -3.319206
H  -0.093556 4.529314 -4.190902
H  -0.764313 4.635936 -2.542163
O  5.132555 -4.100465 1.534884
C  4.719832 -5.317437 2.153982
H  4.895513 -6.139378 1.448636
H  3.648399 -5.252964 2.36433
C  5.566977 -5.487634 3.415857
H  5.751352 -6.53338 3.646678
H  5.08066 -5.018097 4.271527
C  6.835493 -4.720536 3.047174
H  7.392723 -4.369516 3.91149
H  7.483683 -5.338831 2.426796
C  6.262282 -3.573672 2.220436
H  5.935486 -2.749941 2.870999
H  6.963308 -3.185281 1.478017
O  -3.71304 2.130381 0.987149
C  -4.081339 3.22818 1.79936
H  -3.359815 3.295647 2.614596
H  -5.081104 3.056124 2.221855
C  -4.093236 4.463224 0.879316
H  -3.205548 5.072784 1.035081
H  -4.965996 5.078479 1.078123
C  -4.12321 3.862695 -0.537612
H  -4.929514 4.264128 -1.14549
H  -3.180861 4.036471 -1.056091
C  -4.312913 2.363317 -0.274149
H  -5.382253 2.114152 -0.227553
H  -3.823756 1.713988 -1.000039
O  5.135956 2.106028 3.337412
C  5.883503 3.26598 3.022575
H  6.184576 3.782211 3.946123
H  5.246638 3.926347 2.4348
C  7.110116 2.753244 2.267043
H  7.943518 3.446968 2.325605
H  6.859881 2.596235 1.217886
C  7.393645 1.421543 2.975689
H  7.672386 0.640243 2.272115
H  8.198783 1.527831 3.700159
C  6.06788 1.100166 3.696326
H  5.637138 0.143353 3.395051
H  6.208598 1.09849 4.786023
O  5.416651 3.558533 -1.174443
C  5.67403 2.518593 -2.098685
H  5.702624 1.573128 -1.559778
H  6.644686 2.69215 -2.585103
C  4.533612 2.578714 -3.125399
H  3.758227 1.864115 -2.855935
H  4.893095 2.341419 -4.124044
C  4.018836 4.023676 -3.010897
H  4.080676 4.561836 -3.953481
H  2.983759 4.034067 -2.671527
C  4.954317 4.640999 -1.959672
H  5.810011 5.125236 -2.449777
H  4.472317 5.363225 -1.301001
O  0.02849 1.030257 6.75566
C  1.390624 0.679274 6.612037
H  1.977872 1.397529 7.185183
H  1.677991 0.736292 5.551898
C  1.521501 -0.7641 7.123481
H  1.864657 -0.77348 8.156134
H  2.225812 -1.328115 6.516079
C  0.090669 -1.317907 7.016333
H  0.03221 -2.177829 6.352756
H  -0.288557 -1.605358 7.994645
C  -0.711767 -0.134889 6.452476
H  -0.810281 -0.233875 5.362271
H  -1.699833 -0.021625 6.899186
O  0.361476 -3.543012 -2.774708
C  -0.482758 -4.626274 -3.126221
H  -0.315464 -5.424012 -2.402697
H  -0.227169 -4.990446 -4.131933
C  -1.893971 -4.045321 -3.108536
H  -2.246563 -3.957887 -2.081034
H  -2.597599 -4.640938 -3.682752
C  -1.655485 -2.657886 -3.708356
H  -1.779343 -2.67997 -4.790286
H  -2.322052 -1.904394 -3.294427
C  -0.191576 -2.361855 -3.342364
H  0.392696 -2.067417 -4.223429
H  -0.110024 -1.568749 -2.591114
totalener: -5112.94532871 hartree
kineticenergy: 5096.14905390 hartree
exchangeener: -370.012619227006 hartree
correlationener: -26.248154666265 hartree
xcener: -396.260773893272 hartree
chargesum: 1.0000000
charge: -0.192743 -0.388728 -0.024394 0.094724 -0.058893 -0.191753 -0.012407 -0.334319 0.398856 0.067538 -0.219615 -0.098820 -0.273749 0.156699 -0.143485 0.171596 0.142180 0.139227 0.152108 0.157962 0.168797 0.139466 -0.080270 -0.148149 -0.110752 0.145049 0.148021 -0.286500 -0.006997 0.312900 0.175626 0.207229 0.155953 -0.283362 0.095288 0.061841 0.173577 0.161675 0.147522 0.173903 -0.124032 0.189957 -0.206167 -0.166896 0.132682 -0.153803 -0.028169 0.132174 0.132242 -0.337292 -0.029578 0.107234 0.061461 -0.173318 0.122184 0.098582 -0.174627 0.112926 0.103572 -0.067970 0.073603 0.115825 -0.313005 -0.051365 0.090435 0.091333 -0.210723 0.106211 0.124168 -0.144729 0.066712 0.107240 -0.029664 0.083345 0.096864 -0.343523 -0.065314 0.090819 0.156173 -0.174798 0.108659 0.096229 -0.186214 0.082154 0.112178 -0.033735 0.090457 0.093260 -0.330849 0.002493 0.015451 0.086118 -0.164350 0.123195 0.105236 -0.164504 0.107355 0.090841 -0.027623 0.087432 0.079766 -0.327905 -0.059903 0.108412 0.091774 -0.192568 0.127852 0.090182 -0.182719 0.120439 0.117554 -0.041327 0.063892 0.108492 -0.338851 -0.037473 0.101460 0.093260 -0.184266 0.082505 0.116386 -0.189109 0.117962 0.087743 -0.062284 0.097676 0.155354 -0.312988 -0.049674 0.099908 0.109207 -0.181343 0.116675 0.115983 -0.217656 0.096979 0.119311 -0.019683 0.061804 0.090270 -0.336960 -0.010635 0.091440 0.086634 -0.181245 0.083894 0.099065 -0.167005 0.099724 0.112119 -0.059043 0.093642 0.099018 -0.316959 -0.044298 0.109473 0.062457 -0.150512 0.112026 0.079733 -0.192139 0.084409 0.114779 0.066091 -0.022229 0.112157 -0.332774 -0.016950 0.078121 0.092784 -0.171094 0.084389 0.107011 -0.207783 0.103024 0.139685 0.005758 0.081511 0.050229
charge: -0.236833 -0.347739 0.257069 0.285528 -0.143735 -0.131213 -0.089543 -0.084286 -0.127637 -0.147871 -0.071641 -0.102400 -0.078790 -0.151127 -0.071412 0.154650 0.147092 0.151013 0.157703 0.156548 0.156230 0.149310 -0.094727 -0.124344 -0.144674 0.150814 0.153221 -0.083472 0.263219 -0.130094 0.155573 0.156749 0.154033 -0.242754 0.144296 0.032706 0.157280 0.177494 0.156863 -0.154867 -0.050637 0.164072 -0.044661 -0.124880 0.151589 -0.127927 -0.087420 0.145754 0.147837 0.137373 -0.311935 0.122553 0.111947 -0.247278 0.138414 0.133583 -0.248816 0.134368 0.135145 -0.314029 0.116845 0.123569 0.167719 -0.314444 0.116342 0.120777 -0.249021 0.132804 0.135581 -0.252485 0.124065 0.132192 -0.317484 0.115995 0.119988 0.138391 -0.308990 0.118354 0.131334 -0.251301 0.132561 0.134034 -0.252157 0.123952 0.132813 -0.318584 0.114695 0.120658 0.152623 -0.299598 0.125821 0.114339 -0.247736 0.138799 0.131057 -0.251790 0.132543 0.135198 -0.312553 0.116933 0.113109 0.127313 -0.302498 0.122270 0.115121 -0.251829 0.138674 0.127978 -0.247481 0.136516 0.139999 -0.311146 0.111036 0.122125 0.146281 -0.317798 0.115210 0.119510 -0.249226 0.123121 0.134131 -0.250531 0.134884 0.127029 -0.313750 0.119098 0.131645 0.148949 -0.315014 0.120672 0.121683 -0.250569 0.135803 0.133271 -0.250745 0.125844 0.135095 -0.312569 0.108307 0.117896 0.142593 -0.314581 0.120126 0.117005 -0.252107 0.131333 0.131421 -0.252900 0.131130 0.134439 -0.319022 0.119365 0.114478 0.158816 -0.314587 0.121641 0.115085 -0.246175 0.133383 0.128657 -0.246494 0.128835 0.133737 -0.313138 0.109719 0.123262 0.152245 -0.315121 0.114611 0.118764 -0.252860 0.129263 0.131948 -0.248889 0.131148 0.140560 -0.304356 0.113693 0.126438
qa: -0.1927 -0.3887 -0.0244 0.0947 -0.0589 -0.1918 -0.0124 -0.3343 0.3989 0.0675 -0.2196 -0.0988 -0.2737 0.1567 -0.1435 0.1716 0.1422 0.1392 0.1521 0.1580 0.1688 0.1395 -0.0803 -0.1481 -0.1108 0.1450 0.1480 -0.2865 -0.0070 0.3129 0.1756 0.2072 0.1560 -0.2834 0.0953 0.0618 0.1736 0.1617 0.1475 0.1739 -0.1240 0.1900 -0.2062 -0.1669 0.1327 -0.1538 -0.0282 0.1322 0.1322 -0.3373 -0.0296 0.1072 0.0615 -0.1733 0.1222 0.0986 -0.1746 0.1129 0.1036 -0.0680 0.0736 0.1158 -0.3130 -0.0514 0.0904 0.0913 -0.2107 0.1062 0.1242 -0.1447 0.0667 0.1072 -0.0297 0.0833 0.0969 -0.3435 -0.0653 0.0908 0.1562 -0.1748 0.1087 0.0962 -0.1862 0.0822 0.1122 -0.0337 0.0905 0.0933 -0.3308 0.0025 0.0155 0.0861 -0.1644 0.1232 0.1052 -0.1645 0.1074 0.0908 -0.0276 0.0874 0.0798 -0.3279 -0.0599 0.1084 0.0918 -0.1926 0.1279 0.0902 -0.1827 0.1204 0.1176 -0.0413 0.0639 0.1085 -0.3389 -0.0375 0.1015 0.0933 -0.1843 0.0825 0.1164 -0.1891 0.1180 0.0877 -0.0623 0.0977 0.1554 -0.3130 -0.0497 0.0999 0.1092 -0.1813 0.1167 0.1160 -0.2177 0.0970 0.1193 -0.0197 0.0618 0.0903 -0.3370 -0.0106 0.0914 0.0866 -0.1812 0.0839 0.0991 -0.1670 0.0997 0.1121 -0.0590 0.0936 0.0990 -0.3170 -0.0443 0.1095 0.0625 -0.1505 0.1120 0.0797 -0.1921 0.0844 0.1148 0.0661 -0.0222 0.1122 -0.3328 -0.0169 0.0781 0.0928 -0.1711 0.0844 0.1070 -0.2078 0.1030 0.1397 0.0058 0.0815 0.0502
va: 3.0474 3.3843 3.2092 3.0387 3.9494 3.8373 3.9579 3.9181 3.4821 3.9781 3.9010 3.9674 3.8281 3.8293 2.6939 0.9994 0.9714 0.9706 0.9873 0.9717 0.9540 0.9664 3.9845 3.8834 4.0423 0.9693 0.9735 3.9189 3.2075 3.5248 0.9552 0.9573 1.0464 3.8666 1.0422 3.4722 0.9647 1.0343 0.9728 3.5782 3.8574 0.9503 3.9456 3.8934 0.9774 3.9065 3.7982 0.9680 0.9679 1.9214 3.9023 0.9856 0.9704 3.9749 0.9792 0.9767 3.9600 0.9790 0.9808 3.8893 0.9639 1.0025 1.9509 3.9506 0.9665 0.9896 3.9142 0.9787 1.0083 3.9800 1.0011 0.9823 3.9510 0.9738 0.9718 1.9115 3.8985 0.9757 0.9836 3.9053 0.9806 1.0140 3.9591 0.9765 0.9788 3.9771 0.9679 0.9738 1.9579 3.9318 0.9982 0.9608 3.9532 0.9868 0.9679 3.9807 0.9793 0.9883 3.9454 0.9666 0.9675 1.9418 3.9398 0.9645 0.9602 3.9358 0.9796 0.9805 3.9444 0.9786 0.9774 3.9508 0.9613 0.9641 1.9162 3.9491 0.9647 0.9725 3.9345 0.9805 0.9791 3.9456 0.9820 0.9833 3.8569 0.9718 0.9973 1.9651 3.9382 0.9716 0.9721 3.9344 0.9852 0.9917 3.9191 0.9766 0.9760 3.9754 0.9616 0.9697 1.9416 4.0259 0.9724 0.9693 3.9471 0.9925 0.9808 3.9219 0.9816 1.0109 3.9940 0.9744 0.9668 2.0026 4.0242 0.9636 0.9747 3.9566 0.9739 0.9835 3.9945 0.9787 0.9729 4.0098 0.9755 0.9656 1.9507 3.9537 0.9714 0.9704 3.9783 0.9823 0.9814 3.9044 0.9756 1.0055 3.8991 0.9642 0.9957
energy: -5113.379789768711
dipole: 9.87510 -8.03831 1.83679 6.05192 -7.29631 -1.24440 11.31481 -8.61546 2.69935
magnitude: 3.49412 au
magnitude: 8.88134 debye
