program: Orca
programVersion: 5.0.4
elementType: Cu C N N C C C C C C C C C C N H H H H H H H C C C H H C N C H H H C H C H H H C C H C C H C C H H O C C C H H C H C H H C H H C C H H H C H H H C H H H O C C C H H C H C H H C H H C C H H H C H H H C H H H O C C C H H C H C H H C H H C C H H H C H H H C H H H O C C C H H C H C H H C H H C C H H H C H H H C H H H O C C C H H C H C H H C H H C C H H H C H H H C H H H O C C C H H C H C H H C H H C C H H H C H H H C H H H O C C C H H C H C H H C H H C C H H H C H H H C H H H O C C C H H C H C H H C H H C C H H H C H H H C H H H O C C C H H C H C H H C H H C C H H H C H H H C H H H O C C C H H C H C H H C H H C C H H H C H H H C H H H
charge: 1
multiplicity: 1
keywords: wB97X-D4 def2-TZVP def2-TZVP/C VeryTightSCF
formula: C124H180CuN4O10
InChI: InChI=1/C15H11N3.10C10H16O.C8H9.CN.Cu/c1-3-10-16-12(6-1)14-8-5-9-15(18-14)13-7-2-4-11-17-13;10*1-9(2)7-4-5-10(9,3)8(11)6-7;1-2-8-6-4-3-5-7-8;1-2;/h1-11H;10*7H,4-6H2,1-3H3;2-7H,1H3;;/q-3;;;;;;;;;;;;;+3/rC16H11CuN4.10C10H16O.C8H9/c18-12-17-19-10-3-1-6-13(19)15-8-5-9-16(21(15)17)14-7-2-4-11-20(14)17;10*1-9(2)7-4-5-10(9,3)8(11)6-7;1-2-8-6-4-3-5-7-8/h1-11H;10*7H,4-6H2,1-3H3;2-7H,1H3
319 atoms
Cu 0.000005 -0.000005 -0.000001
C  -1.496368 0.019925 -1.232634
N  0.4055 1.98644 0.285584
N  2.016888 -0.000001 0.000002
C  -0.511863 2.954696 0.293981
C  -0.173519 4.291262 0.19642
C  1.16373 4.63301 0.068553
C  2.11831 3.63222 0.048479
C  1.71713 2.30934 0.16318
C  2.634721 1.166611 0.193078
C  3.99133 1.202928 0.48555
C  4.667077 -0.003158 0.608262
C  3.985094 -1.205015 0.501536
C  2.627549 -1.16652 0.207641
N  -2.439851 0.025648 -1.919327
H  -1.540302 2.637421 0.382794
H  -0.948571 5.042623 0.218232
H  1.4603 5.66785 -0.02433
H  3.16401 3.87335 -0.06655
H  4.506818 2.138351 0.639734
H  4.493885 -2.140317 0.676142
H  5.721953 -0.004594 0.841155
C  1.15301 -4.632641 0.192039
C  -0.187589 -4.285451 0.223874
C  -0.526841 -2.945253 0.228714
H  1.452281 -5.67073 0.176971
H  -0.964971 -5.034559 0.239539
C  2.109432 -3.633633 0.165397
N  0.39137 -1.980029 0.229473
C  1.706339 -2.306531 0.186629
H  3.15851 -3.881526 0.120571
H  -1.557837 -2.624241 0.2368
H  -2.158867 0.636561 1.749694
C  -1.750627 -0.133462 2.398859
H  -2.080603 -1.11065 2.058299
C  -0.295073 -0.006871 2.545794
H  -2.204969 0.02492 3.386249
H  0.109113 0.994191 2.512645
H  -0.89255 -2.584806 3.198147
C  0.567686 -0.992389 3.059541
C  0.137673 -2.306715 3.356082
H  2.256922 0.344449 3.06298
C  1.921146 -0.656974 3.292609
C  1.02553 -3.23064 3.85315
H  0.69063 -4.23333 4.078249
C  2.801478 -1.590656 3.789941
C  2.359378 -2.880825 4.065467
H  3.834912 -1.324194 3.959231
H  3.052011 -3.616452 4.450508
O  1.480575 2.899533 3.047701
C  0.231746 4.129188 4.752776
C  1.313168 3.890675 3.721725
C  2.193269 5.120363 3.74042
H  3.229106 4.849312 3.948123
H  2.175767 5.609953 2.767067
C  1.550449 5.961318 4.844797
H  1.830333 7.012859 4.82451
C  1.874832 5.250316 6.164626
H  2.939515 5.032885 6.246589
H  1.601441 5.863016 7.02147
C  1.023238 3.971023 6.07757
H  1.631913 3.067589 6.059374
H  0.326439 3.882387 6.909322
C  0.04621 5.664632 4.657898
C  -0.986979 3.239501 4.631649
H  -1.445229 3.360153 3.652538
H  -0.70893 2.194036 4.750426
H  -1.718468 3.493479 5.395049
C  -0.503863 6.113947 3.303568
H  -1.579486 5.956714 3.270068
H  -0.314758 7.175464 3.15764
H  -0.060644 5.56091 2.480888
C  -0.842376 6.27102 5.741214
H  -0.56638 5.95825 6.741462
H  -0.77768 7.35609 5.693784
H  -1.879259 5.988706 5.573574
O  0.661082 3.452804 -2.673368
C  -1.051717 4.700549 -3.883851
C  -0.303982 3.472537 -3.407276
C  -0.945622 2.294099 -4.090986
H  -0.206602 1.730602 -4.662017
H  -1.362043 1.605289 -3.354756
C  -2.015295 2.964469 -4.955267
H  -2.797583 2.28919 -5.29437
C  -1.263001 3.67679 -6.086377
H  -0.561981 3.005437 -6.581546
H  -1.948346 4.050769 -6.844505
C  -0.547765 4.821185 -5.346595
H  0.538546 4.730371 -5.391854
H  -0.811945 5.799502 -5.745735
C  -2.480311 4.133075 -4.058514
C  -0.85198 5.948777 -3.050941
H  -1.333413 5.836504 -2.083591
H  0.211386 6.113677 -2.888466
H  -1.269727 6.816638 -3.555026
C  -3.102935 3.676563 -2.738016
H  -3.48501 4.53389 -2.188503
H  -3.9352 3.006116 -2.937235
H  -2.389662 3.157191 -2.103701
C  -3.465876 5.084138 -4.731726
H  -3.092345 5.485039 -5.666568
H  -4.395336 4.556273 -4.933593
H  -3.687381 5.918653 -4.070348
O  -3.686599 -2.2096 0.544559
C  -5.549801 -0.657427 0.820325
C  -4.630871 -1.609913 0.082091
C  -5.087766 -1.607461 -1.353325
H  -4.26656 -1.281514 -1.994341
H  -5.379149 -2.605953 -1.674994
C  -6.249244 -0.612933 -1.323851
H  -6.925423 -0.691119 -2.17336
C  -5.609426 0.769802 -1.153726
H  -4.805521 0.918199 -1.872368
H  -6.337732 1.567803 -1.288963
C  -5.067497 0.715359 0.284987
H  -3.978711 0.772775 0.298346
H  -5.45776 1.517427 0.909826
C  -6.879411 -0.873986 0.060357
C  -5.555775 -0.789175 2.328696
H  -5.989336 -1.743128 2.619234
H  -4.539039 -0.743438 2.708648
H  -6.138193 0.010524 2.779848
C  -7.430196 -2.293002 0.21959
H  -7.961943 -2.386499 1.163771
H  -8.131445 -2.512503 -0.582545
H  -6.641871 -3.040632 0.206359
C  -7.986971 0.10682 0.432053
H  -7.654986 1.13833 0.417169
H  -8.809056 0.003053 -0.271645
H  -8.362076 -0.113816 1.42884
O  3.838754 1.317351 -2.343978
C  5.376638 3.088775 -3.028611
C  4.145056 2.213442 -3.097273
C  3.402262 2.636358 -4.342015
H  3.246331 1.78768 -5.007739
H  2.419361 3.012068 -4.059189
C  4.325464 3.70435 -4.927146
H  3.8500 4.353907 -5.660657
C  5.550751 2.949836 -5.455532
H  5.262427 2.125024 -6.106065
H  6.201798 3.60796 -6.025112
C  6.226414 2.457504 -4.164875
H  6.22623 1.369844 -4.0856
H  7.259934 2.792011 -4.084993
C  4.870472 4.405249 -3.664903
C  6.084788 3.144551 -1.692792
H  5.483226 3.680494 -0.962828
H  6.254564 2.131459 -1.334575
H  7.043215 3.648422 -1.792212
C  3.786462 5.108013 -2.846049
H  4.226208 5.562976 -1.961048
H  3.340397 5.902704 -3.441406
H  2.996193 4.433992 -2.528563
C  5.970216 5.426692 -3.944957
H  6.841101 4.983261 -4.412617
H  5.584901 6.203617 -4.601409
H  6.287802 5.895287 -3.016252
O  5.396655 -4.109699 -0.286234
C  6.716564 -4.384722 1.749864
C  6.466493 -4.247449 0.263184
C  7.814484 -4.366424 -0.407434
H  7.821986 -5.195351 -1.116909
H  8.038274 -3.462941 -0.974844
C  8.749483 -4.577799 0.785459
H  9.795742 -4.369223 0.571959
C  8.47945 -6.003457 1.282214
H  8.535505 -6.725122 0.467997
H  9.203143 -6.301889 2.037884
C  7.059578 -5.894312 1.865117
H  6.338371 -6.501052 1.315525
H  7.018842 -6.202379 2.908889
C  8.099799 -3.703386 1.880521
C  5.598554 -3.927145 2.663178
H  5.530459 -2.842179 2.676167
H  4.647386 -4.332844 2.323412
H  5.782282 -4.272328 3.677898
C  8.056572 -2.213508 1.536591
H  7.570041 -1.663763 2.339213
H  9.068827 -1.831195 1.421155
H  7.506427 -2.016028 0.62043
C  8.741548 -3.840039 3.258532
H  8.731588 -4.858501 3.629329
H  9.775398 -3.503891 3.213203
H  8.210038 -3.214762 3.972187
O  5.642037 -0.853736 -3.796816
C  3.926637 -1.933233 -5.153865
C  4.635104 -1.5190 -3.880911
C  3.872292 -2.163409 -2.753475
H  4.52148 -2.759809 -2.111521
H  3.436946 -1.376773 -2.139447
C  2.819294 -2.985663 -3.497022
H  1.98875 -3.300253 -2.868131
C  3.580771 -4.135535 -4.166462
H  4.233506 -4.637915 -3.453795
H  2.901982 -4.883178 -4.575279
C  4.371892 -3.415489 -5.273864
H  5.450885 -3.509392 -5.143683
H  4.12383 -3.791292 -6.265276
C  2.457866 -2.06743 -4.683668
C  4.236933 -1.082889 -6.366375
H  3.812559 -0.0881 -6.249165
H  5.314833 -0.9825 -6.475646
H  3.830469 -1.533079 -7.267708
C  1.820427 -0.746092 -4.250677
H  1.520823 -0.177077 -5.128826
H  0.928413 -0.941436 -3.656504
H  2.490321 -0.130181 -3.658618
C  1.536952 -2.690299 -5.731725
H  1.814183 -3.702918 -6.002241
H  0.517961 -2.708785 -5.35399
H  1.544284 -2.083716 -6.635063
O  6.007458 -0.250691 3.589109
C  5.970002 1.914924 4.71774
C  6.558203 0.77657 3.91045
C  7.999378 1.149712 3.642904
H  8.675073 0.382779 4.023357
H  8.181534 1.231284 2.57147
C  8.126864 2.486983 4.37506
H  8.98169 3.084493 4.064642
C  8.103518 2.153795 5.872495
H  8.822677 1.372888 6.117318
H  8.349973 3.026014 6.474723
C  6.650436 1.696885 6.095359
H  6.585887 0.651539 6.399949
H  6.143987 2.290876 6.854897
C  6.741019 3.129618 4.146268
C  4.458296 1.96373 4.769806
H  4.040268 2.146832 3.782245
H  4.068372 1.014455 5.129642
H  4.129863 2.750236 5.445187
C  6.42304 3.397818 2.674299
H  5.44719 3.871283 2.586433
H  7.165561 4.071124 2.251075
H  6.405391 2.485657 2.085203
C  6.533661 4.435759 4.909535
H  6.648424 4.321822 5.981021
H  7.255144 5.174305 4.566234
H  5.5369 4.826559 4.71694
O  -2.361002 -6.672576 0.960382
C  -3.703236 -5.616637 2.707811
C  -3.254478 -6.720798 1.773886
C  -4.179358 -7.889836 2.026739
H  -4.688491 -8.186829 1.109102
H  -3.612567 -8.755062 2.370721
C  -5.120379 -7.326781 3.093179
H  -5.665584 -8.084491 3.649634
C  -6.014413 -6.3063 2.375926
H  -6.457399 -6.73148 1.476024
H  -6.828869 -5.973291 3.016488
C  -5.034156 -5.165502 2.056479
H  -4.901483 -5.010298 0.985392
H  -5.343842 -4.214849 2.487692
C  -4.179676 -6.43468 3.931676
C  -2.712846 -4.492868 2.917639
H  -1.726492 -4.894691 3.13715
H  -2.657352 -3.890195 2.015235
H  -3.037354 -3.860203 3.74019
C  -3.042456 -7.202904 4.609937
H  -2.476598 -6.535357 5.255289
H  -3.447318 -8.003367 5.225792
H  -2.350284 -7.634382 3.891794
C  -4.896239 -5.621771 5.006667
H  -5.68513 -4.99656 4.605599
H  -5.333476 -6.297782 5.73774
H  -4.186959 -4.981108 5.525071
O  -1.024874 -0.15791 5.385067
C  0.367375 -0.290974 7.381763
C  -0.831479 -0.575872 6.501651
C  -1.789324 -1.394543 7.336047
H  -2.776536 -0.932111 7.365188
H  -1.90741 -2.387715 6.904499
C  -1.082171 -1.41945 8.691468
H  -1.451665 -2.180934 9.375376
C  -1.171428 0.011291 9.239083
H  -2.192341 0.388944 9.195794
H  -0.845246 0.055503 10.274265
C  -0.222096 0.795858 8.316765
H  -0.740682 1.562825 7.740783
H  0.579823 1.28222 8.870405
C  0.402484 -1.544188 8.285846
C  1.630002 0.108762 6.651522
H  2.10279 -0.765719 6.211927
H  1.387106 0.797121 5.844343
H  2.331275 0.586588 7.331151
C  0.717915 -2.824493 7.507386
H  1.793796 -2.939146 7.396792
H  0.343274 -3.691231 8.047729
H  0.286306 -2.814647 6.510048
C  1.380877 -1.456074 9.453549
H  1.229419 -0.574152 10.064665
H  1.268679 -2.333713 10.086357
H  2.402112 -1.436995 9.079764
O  -0.66073 -6.271018 -5.601787
C  -1.53787 -5.586898 -3.426047
C  -1.451544 -5.641258 -4.939004
C  -2.51103 -4.690491 -5.454755
H  -2.072925 -3.941059 -6.114762
H  -3.251625 -5.237644 -6.034934
C  -3.082908 -4.11293 -4.159069
H  -4.052115 -3.632568 -4.278195
C  -1.989538 -3.199118 -3.591614
H  -1.620382 -2.511858 -4.352871
H  -2.348536 -2.592046 -2.762709
C  -0.915281 -4.200523 -3.136852
H  0.023792 -4.085299 -3.67693
H  -0.70459 -4.113109 -2.074309
C  -3.046833 -5.330136 -3.208967
C  -0.878355 -6.743679 -2.705042
H  -1.300577 -7.688039 -3.041834
H  0.187334 -6.754723 -2.923468
H  -1.019462 -6.659846 -1.631057
C  -3.902753 -6.510402 -3.671998
H  -3.930416 -7.269756 -2.893729
H  -4.922343 -6.184534 -3.866505
H  -3.504676 -6.973106 -4.570601
C  -3.446886 -5.007966 -1.772646
H  -3.006463 -4.090239 -1.401897
H  -4.53037 -4.913106 -1.720374
H  -3.149905 -5.820304 -1.113794
totalener: -7449.58014914 hartree
kineticenergy: 7423.36372569 hartree
exchangeener: -596.235827020059 hartree
correlationener: -44.343793320166 hartree
xcener: -640.579620340225 hartree
chargesum: 1.0000000
qa: -0.3273 -0.2688 -0.0598 0.1104 -0.1175 -0.1092 -0.1051 -0.2355 0.4176 0.1004 -0.2642 0.0604 -0.2159 0.1193 -0.1632 0.1655 0.1537 0.1387 0.1075 0.1302 0.0621 0.1434 -0.0484 -0.1358 -0.1871 0.1485 0.1753 -0.2259 0.0248 0.2287 0.1211 0.2306 0.1285 -0.3724 0.1319 0.0523 0.1932 0.1989 0.1859 0.2761 -0.1166 0.1911 -0.1641 -0.2393 0.1288 -0.2614 -0.0093 0.1640 0.1444 -0.3583 0.4438 -0.0468 -0.2320 0.0885 0.1385 0.0822 0.1238 -0.2868 0.1070 0.1321 -0.3490 0.1052 0.1332 0.0213 -0.3977 0.1174 0.1311 0.1317 -0.3679 0.1262 0.1277 0.0540 -0.3852 0.1218 0.1307 0.1266 -0.3749 0.3794 -0.0308 -0.2431 0.1166 0.1687 0.0752 0.1153 -0.2548 0.0950 0.1231 -0.3044 0.1042 0.1232 0.0421 -0.3607 0.0938 0.1231 0.1319 -0.4227 0.1140 0.1270 0.1119 -0.3760 0.1200 0.1238 0.1187 -0.3880 0.3906 -0.0225 -0.3249 0.1740 0.1340 0.1797 0.1159 -0.3367 0.1303 0.1165 -0.2431 0.0598 0.1150 0.0062 -0.3619 0.1135 0.1094 0.1269 -0.4188 0.1210 0.1279 0.1201 -0.3859 0.1219 0.1248 0.1192 -0.3529 0.4426 -0.0448 -0.2215 0.1126 0.0912 0.0644 0.1128 -0.2654 0.1078 0.1206 -0.3113 0.1554 0.1104 0.0798 -0.4258 0.0930 0.1349 0.1316 -0.4888 0.1111 0.1162 0.1545 -0.3806 0.1263 0.1223 0.1143 -0.3514 0.3615 0.0042 -0.2344 0.1340 0.1579 0.0183 0.1178 -0.2672 0.1108 0.1262 -0.2823 0.1162 0.1221 0.0686 -0.4332 0.1226 0.1241 0.1252 -0.4502 0.1261 0.1239 0.1281 -0.3925 0.1228 0.1249 0.1237 -0.3296 0.3057 -0.0344 -0.2796 0.1307 0.1438 0.0269 0.1296 -0.2719 0.0981 0.1360 -0.2830 0.1081 0.1259 0.1849 -0.3839 0.0940 0.1351 0.1297 -0.5537 0.1188 0.1444 0.1385 -0.3759 0.1373 0.0936 0.1235 -0.3504 0.5002 -0.0961 -0.2531 0.1348 0.1501 0.0638 0.1239 -0.2755 0.1119 0.1298 -0.2850 0.1134 0.1250 0.0572 -0.4913 0.1412 0.1187 0.1185 -0.4555 0.1213 0.1367 0.1109 -0.3792 0.1250 0.1321 0.1104 -0.3242 0.5267 -0.0349 -0.2083 0.1281 0.1433 0.0008 0.1207 -0.2463 0.1078 0.1229 -0.3549 0.1208 0.1062 0.0385 -0.5279 0.1156 0.1157 0.1258 -0.3961 0.1108 0.1298 0.1272 -0.3940 0.1235 0.1287 0.1105 -0.3532 0.4509 -0.0195 -0.2122 0.1303 0.1410 -0.0029 0.1233 -0.2533 0.1078 0.1299 -0.3125 0.1113 0.1273 0.0337 -0.4855 0.1280 0.1185 0.1334 -0.4007 0.1211 0.1335 0.1012 -0.3806 0.1205 0.1295 0.1229 -0.2813 0.3377 -0.0664 -0.2105 0.1200 0.1363 0.1001 0.1052 -0.3679 0.1080 0.1517 -0.2223 0.0838 0.0069 0.1963 -0.3827 0.1253 0.1245 0.1192 -0.3977 0.1218 0.1161 0.1306 -0.5649 0.1188 0.1073 0.1443
va: 2.9402 3.4249 3.1746 3.0236 4.1068 3.8416 3.9846 3.9561 3.4523 3.9647 3.9127 3.9424 3.9444 3.7334 2.6917 0.9544 0.9665 0.9747 0.9834 0.9664 1.0518 0.9574 3.9208 3.8183 3.9829 0.9676 0.9989 3.8053 3.2094 3.5486 1.0383 0.9608 0.9857 3.9433 1.0009 3.5501 0.9829 0.9794 0.9183 3.6151 3.7416 0.9268 3.8387 3.8459 0.9806 3.8645 3.7435 1.0044 0.9646 2.0896 3.2759 3.9983 4.0417 1.0184 0.9816 3.7627 0.9675 4.0763 0.9822 0.9703 3.9872 0.9906 0.9677 3.9990 3.8565 0.9761 1.0073 0.9710 3.9053 0.9769 0.9791 1.0193 3.8898 0.9691 0.9754 0.9739 2.0606 3.3662 4.0082 3.9741 0.9930 1.0312 3.7651 0.9719 4.0403 0.9844 0.9664 4.0263 0.9849 0.9676 4.0275 3.8756 0.9783 0.9805 0.9720 3.9397 0.9708 0.9820 0.9836 3.8779 0.9704 0.9773 0.9744 2.0495 3.4646 4.0052 4.0224 0.9976 0.9704 3.7224 0.9639 4.1160 0.9891 0.9623 4.0437 1.0104 0.9638 4.0269 3.8717 0.9752 0.9833 0.9719 3.9215 0.9743 0.9777 0.9727 3.8896 0.9677 0.9763 0.9741 2.0656 3.3323 4.0129 3.9521 0.9986 1.0578 3.7673 0.9692 4.0587 0.9857 0.9658 3.9898 1.0231 0.9702 3.9432 3.8790 0.9667 0.9763 0.9736 3.9053 0.9688 0.9823 0.9820 3.8865 0.9686 0.9773 0.9737 2.0914 3.4854 4.0244 3.9870 0.9891 0.9745 3.7772 0.9734 4.0405 0.9809 0.9685 3.9970 0.9814 0.9700 3.9786 3.8414 0.9899 0.9836 0.9725 3.9097 0.9969 0.9764 0.9688 3.8732 0.9712 0.9768 0.9746 2.1522 3.3909 4.1980 3.8560 1.0240 1.0059 3.7235 0.9613 4.0670 0.9870 0.9724 4.0085 0.9826 0.9703 3.8624 3.8726 0.9803 0.9823 0.9707 3.9043 0.9608 0.9821 0.9940 3.8835 0.9730 0.9973 0.9749 2.0864 3.2579 4.0903 3.9669 0.9861 0.9719 3.7446 0.9722 4.0484 0.9799 0.9699 3.9929 0.9834 0.9685 3.9640 3.8697 0.9727 0.9807 0.9707 3.9351 0.9709 0.9770 0.9728 3.8935 0.9703 0.9781 0.9842 2.1380 3.2066 4.1178 3.9478 0.9901 0.9784 3.8077 0.9736 4.0386 0.9824 0.9695 4.0380 0.9925 0.9807 3.9757 3.8481 0.9688 0.9987 0.9663 3.9127 0.9754 0.9762 0.9705 3.8966 0.9695 0.9764 0.9753 2.1022 3.3340 4.0333 4.0042 0.9898 0.9725 3.8112 0.9730 4.0596 0.9813 0.9697 4.0245 0.9820 0.9682 3.9868 3.8739 0.9680 0.9808 0.9642 3.9277 0.9772 0.9759 0.9800 3.8853 0.9713 0.9747 0.9736 2.2122 3.3291 4.1848 3.9055 0.9927 0.9791 3.7169 0.9670 4.0438 0.9859 0.9791 3.9045 1.0308 1.0797 3.8548 3.8843 0.9787 0.9800 0.9825 3.9149 0.9729 0.9763 0.9707 3.9121 0.9823 0.9728 0.9789
energy: -7450.452768699000
dipole: -14.98098 15.96993 0.98896 20.66909 -17.81321 2.85588 38.95329 -31.78797 7.16532
magnitude: 7.77663 au
magnitude: 19.76662 debye
