program: Orca
programVersion: 5.0.4
elementType: Cu C N N C C C C C C C C C C N H H H H H H H C C C H H C N C H H H C H C H H H C C H C C H C C H H O N C C C C C C C C C C C C C H H H H H H H H H H H H H H H H H H H H H O N C C C C C C C C C C C C C H H H H H H H H H H H H H H H H H H H H H O N C C C C C C C C C C C C C H H H H H H H H H H H H H H H H H H H H H O N C C C C C C C C C C C C C H H H H H H H H H H H H H H H H H H H H H O N C C C C C C C C C C C C C H H H H H H H H H H H H H H H H H H H H H O N C C C C C C C C C C C C C H H H H H H H H H H H H H H H H H H H H H O N C C C C C C C C C C C C C H H H H H H H H H H H H H H H H H H H H H O N C C C C C C C C C C C C C H H H H H H H H H H H H H H H H H H H H H O N C C C C C C C C C C C C C H H H H H H H H H H H H H H H H H H H H H O N C C C C C C C C C C C C C H H H H H H H H H H H H H H H H H H H H H
charge: 1
multiplicity: 1
keywords: wB97X-D4 def2-TZVP def2-TZVP/C VeryTightSCF
formula: C154H230CuN14O10
InChI: InChI=1/C15H11N3.10C13H21NO.C8H9.CN.Cu/c1-3-10-16-12(6-1)14-8-5-9-15(18-14)13-7-2-4-11-17-13;10*1-12(2)10-6-7-13(12,3)11(15)9(10)8-14(4)5;1-2-8-6-4-3-5-7-8;1-2;/h1-11H;10*8,10H,6-7H2,1-5H3;2-7H,1H3;;/q-3;;;;;;;;;;;;;+3/rC16H11CuN4.10C13H21NO.C8H9/c18-12-17-19-10-3-1-6-13(19)15-8-5-9-16(21(15)17)14-7-2-4-11-20(14)17;10*1-12(2)10-6-7-13(12,3)11(15)9(10)8-14(4)5;1-2-8-6-4-3-5-7-8/h1-11H;10*8,10H,6-7H2,1-5H3;2-7H,1H3
409 atoms
Cu 0.0000 -0.0000 -0.0000
C  -1.49637 0.01992 -1.23263
N  0.4055 1.98644 0.285581
N  2.016891 -0.0000 0.0000
C  -0.51186 2.954691 0.293979
C  -0.17352 4.29126 0.196421
C  1.16373 4.63301 0.068549
C  2.11831 3.632219 0.048481
C  1.71713 2.30934 0.163179
C  2.63472 1.16661 0.19308
C  3.991329 1.202931 0.485551
C  4.667079 -0.00316 0.608249
C  3.985101 -1.20501 0.501543
C  2.627548 -1.16652 0.207644
N  -2.43984 0.02566 -1.91934
H  -1.5403 2.637429 0.38284
H  -0.94857 5.04262 0.218249
H  1.4603 5.66785 -0.02433
H  3.16401 3.873351 -0.06655
H  4.506821 2.138349 0.63973
H  4.493874 -2.140326 0.676137
H  5.72195 -0.00459 0.84117
C  1.15301 -4.632639 0.19204
C  -0.18759 -4.28545 0.22387
C  -0.52684 -2.94525 0.22873
H  1.45228 -5.67073 0.17697
H  -0.96497 -5.03456 0.23954
C  2.109425 -3.633661 0.165405
N  0.39137 -1.98003 0.229471
C  1.70634 -2.306529 0.186625
H  3.15852 -3.881494 0.120567
H  -1.55783 -2.62424 0.23677
H  -2.158827 0.63658 1.749738
C  -1.750734 -0.13329 2.398353
H  -2.080559 -1.11079 2.058659
C  -0.29507 -0.00688 2.545829
H  -2.204979 0.02488 3.38629
H  0.10912 0.99418 2.51265
H  -0.89255 -2.584809 3.198141
C  0.56769 -0.99239 3.05953
C  0.13767 -2.306711 3.356089
H  2.25692 0.34445 3.06298
C  1.92115 -0.65698 3.2926
C  1.02553 -3.23064 3.85315
H  0.69063 -4.23333 4.07825
C  2.80146 -1.59061 3.78998
C  2.35938 -2.88083 4.06546
H  3.83493 -1.32424 3.9592
H  3.05201 -3.61645 4.45051
O  5.646875 4.04233 0.735652
N  6.770307 8.081474 1.240722
C  7.520593 3.79082 -0.836707
C  6.618912 4.51678 0.158575
C  7.149675 5.857688 0.249429
C  8.342443 5.880404 -0.67691
C  7.753867 5.856083 -2.100547
C  7.129448 4.452398 -2.180651
C  8.8851 4.443089 -0.513551
C  7.422612 2.280982 -0.827125
C  10.016098 4.085848 -1.475073
C  9.371764 4.15814 0.908285
C  6.523845 6.782978 1.020777
C  7.884407 8.78962 0.659219
C  6.022166 8.810447 2.234204
H  9.075357 6.663678 -0.505416
H  6.999626 6.632409 -2.232725
H  8.528083 6.004372 -2.853012
H  6.042986 4.502268 -2.271087
H  7.511815 3.872041 -3.020024
H  6.417149 1.973714 -1.106865
H  8.127798 1.845968 -1.532074
H  7.633124 1.896404 0.168538
H  9.712445 4.136195 -2.514647
H  10.851011 4.76844 -1.326853
H  10.367252 3.075849 -1.274332
H  8.595394 4.357988 1.643342
H  9.67112 3.116568 1.00272
H  10.234332 4.781529 1.136869
H  5.656223 6.399688 1.54856
H  8.815922 8.573777 1.190677
H  7.999716 8.516204 -0.387243
H  7.691019 9.859153 0.717879
H  5.623156 9.729654 1.800104
H  5.193147 8.205787 2.592066
H  6.661629 9.074906 3.08145
O  0.869582 3.194548 2.971247
N  -0.922729 6.992666 3.582009
C  2.835804 4.054051 4.174605
C  1.425488 4.09391 3.602296
C  0.901983 5.38881 3.957365
C  1.980428 6.042796 4.790658
C  3.074488 6.449758 3.787663
C  3.604626 5.086795 3.311505
C  2.611325 4.822497 5.498393
C  3.496654 2.69427 4.214412
C  3.882975 5.132681 6.284334
C  1.633511 4.12673 6.445461
C  -0.288406 5.824119 3.45877
C  -0.412002 8.096942 4.358897
C  -2.237577 7.182437 3.020447
H  1.662047 6.837202 5.458888
H  2.660092 7.035395 2.965863
H  3.849062 7.040931 4.276793
H  3.420049 4.911658 2.2507
H  4.677647 4.97604 3.46953
H  3.598861 2.314858 3.198093
H  4.491469 2.766866 4.649959
H  2.911584 1.983101 4.79415
H  4.699469 5.459044 5.649496
H  3.682116 5.912476 7.017144
H  4.206553 4.241532 6.817713
H  0.659197 3.99314 5.983042
H  2.009467 3.143631 6.72169
H  1.510175 4.716392 7.352171
H  -0.810757 5.102982 2.839296
H  -0.531885 7.916617 5.43059
H  0.641735 8.258905 4.140589
H  -0.963502 8.997915 4.097994
H  -2.253496 8.085449 2.406546
H  -2.5172 6.339533 2.391395
H  -2.978556 7.29565 3.817044
O  5.312621 -4.113231 -0.010106
N  9.156521 -3.863394 1.696461
C  6.012776 -6.1937 -1.118097
C  6.156944 -4.989362 -0.195765
C  7.488548 -5.068869 0.345359
C  8.089092 -6.320034 -0.251061
C  8.362496 -5.971363 -1.726926
C  6.942877 -5.823998 -2.302741
C  6.849235 -7.238923 -0.344938
C  4.595773 -6.541558 -1.520629
C  7.079127 -8.54967 -1.090978
C  6.267777 -7.579529 1.026542
C  7.961384 -4.069612 1.139778
C  10.263936 -4.776339 1.548064
C  9.397111 -2.710868 2.529071
H  8.936851 -6.748444 0.275199
H  8.936219 -5.047735 -1.814823
H  8.922098 -6.763671 -2.222995
H  6.74026 -4.806948 -2.64135
H  6.769307 -6.494287 -3.144255
H  4.070195 -5.637165 -1.822799
H  4.596096 -7.243158 -2.351899
H  4.059679 -6.993043 -0.689062
H  7.386295 -8.401799 -2.120568
H  7.847692 -9.130627 -0.584016
H  6.159244 -9.130213 -1.089119
H  6.105959 -6.684125 1.622945
H  5.314123 -8.091785 0.917852
H  6.948071 -8.235301 1.567145
H  7.232575 -3.293555 1.353748
H  10.106582 -5.681522 2.139539
H  10.391677 -5.051431 0.501654
H  11.170896 -4.29038 1.899688
H  10.172755 -2.08101 2.085839
H  8.48702 -2.124939 2.631185
H  9.729477 -3.014579 3.5252
O  -3.297132 5.142591 0.682517
N  -3.567101 2.921343 -2.896959
C  -5.575193 4.391046 1.230705
C  -4.287759 4.464671 0.41082
C  -4.504475 3.611136 -0.72676
C  -5.891312 3.039856 -0.541456
C  -6.853963 4.207629 -0.83334
C  -6.595491 5.156834 0.351677
C  -5.970418 2.914622 0.996599
C  -5.467739 4.901973 2.652046
C  -7.346115 2.518937 1.527006
C  -4.950092 1.921927 1.553172
C  -3.569682 3.538145 -1.716305
C  -4.637491 2.068184 -3.352064
C  -2.369475 2.874182 -3.697915
H  -6.111939 2.124574 -1.081182
H  -6.623934 4.680004 -1.788788
H  -7.890132 3.872242 -0.866812
H  -6.18149 6.114025 0.030056
H  -7.502904 5.365549 0.918441
H  -5.225042 5.96245 2.641437
H  -6.407703 4.764811 3.181884
H  -4.676565 4.376794 3.181628
H  -8.121791 3.224131 1.251266
H  -7.619466 1.540756 1.136786
H  -7.321267 2.454368 2.612774
H  -3.938753 2.19505 1.262826
H  -5.008317 1.897719 2.638735
H  -5.161499 0.924331 1.175483
H  -2.668396 4.108228 -1.51424
H  -4.556764 1.079698 -2.894707
H  -5.599297 2.512066 -3.10944
H  -4.565188 1.958895 -4.432566
H  -2.592146 3.186945 -4.720368
H  -1.607068 3.530737 -3.285946
H  -1.973756 1.855431 -3.718118
O  -2.794946 -6.395298 0.500817
N  -4.323676 -2.831034 -1.162811
C  -4.331731 -6.07802 2.39802
C  -3.687609 -5.753581 1.053012
C  -4.271107 -4.508023 0.632244
C  -5.193648 -4.098517 1.755566
C  -4.276409 -3.704422 2.929332
C  -3.652754 -5.051321 3.339475
C  -5.741578 -5.473509 2.201998
C  -4.216489 -7.519775 2.843037
C  -6.605718 -5.428419 3.459841
C  -6.55194 -6.166209 1.105323
C  -3.979557 -3.984473 -0.5912
C  -4.942046 -1.733801 -0.464959
C  -4.124377 -2.610174 -2.573487
H  -5.957688 -3.367292 1.508266
H  -3.518765 -2.988213 2.610597
H  -4.844756 -3.255072 3.742327
H  -2.570134 -5.066352 3.202679
H  -3.858032 -5.302284 4.379732
H  -3.172474 -7.824108 2.830158
H  -4.607081 -7.646836 3.850638
H  -4.766812 -8.170827 2.167406
H  -6.085567 -5.010833 4.314458
H  -7.493718 -4.827398 3.272177
H  -6.929814 -6.433661 3.721158
H  -5.969262 -6.295741 0.196609
H  -6.882072 -7.146553 1.441887
H  -7.435168 -5.576025 0.868058
H  -3.361513 -4.624784 -1.213628
H  -6.019617 -1.701788 -0.647615
H  -4.75803 -1.81914 0.601356
H  -4.494317 -0.804779 -0.823522
H  -3.523191 -1.710314 -2.721151
H  -3.618253 -3.460212 -3.022091
H  -5.089239 -2.473849 -3.068303
O  2.606538 0.952147 -2.630346
N  0.954092 -2.915183 -3.146794
C  4.610696 0.158159 -3.812114
C  3.214335 0.051472 -3.202383
C  2.79876 -1.313633 -3.419488
C  3.968738 -1.978593 -4.105342
C  5.074352 -2.09772 -3.039647
C  5.490216 -0.633469 -2.816617
C  4.48181 -0.82504 -4.999555
C  5.070074 1.574096 -4.080215
C  5.784923 -1.129303 -5.734804
C  3.451957 -0.386559 -6.042488
C  1.545577 -1.71544 -3.082663
C  1.65338 -4.121207 -3.511135
C  -0.483399 -3.020724 -3.100531
H  3.755415 -2.901767 -4.635086
H  4.705028 -2.561008 -2.123565
H  5.9061 -2.701139 -3.403134
H  5.305092 -0.303973 -1.794139
H  6.546433 -0.467756 -3.029385
H  4.973548 2.168174 -3.172492
H  6.107264 1.593508 -4.4073
H  4.441829 2.024887 -4.845504
H  6.591333 -1.405977 -5.065232
H  5.625624 -1.949169 -6.432847
H  6.101177 -0.257679 -6.304013
H  2.524482 -0.061842 -5.577163
H  3.844286 0.436143 -6.635957
H  3.232108 -1.213326 -6.714989
H  0.910286 -0.926804 -2.686523
H  1.677772 -4.268427 -4.594929
H  2.670258 -4.084771 -3.128479
H  1.143853 -4.971379 -3.058768
H  -0.769191 -3.872147 -2.481504
H  -0.909702 -2.114308 -2.676943
H  -0.887232 -3.165882 -4.107246
O  2.95026 -8.608551 0.739352
N  -0.808863 -9.428654 -0.971391
C  1.888005 -8.666889 2.95793
C  1.948323 -8.760227 1.434753
C  0.594892 -9.00799 1.006245
C  -0.228234 -9.014307 2.271866
C  -0.260212 -7.551323 2.755358
C  1.19585 -7.300314 3.184459
C  0.755373 -9.675884 3.263826
C  3.216803 -8.828617 3.664365
C  0.27564 -9.691294 4.713311
C  1.105523 -11.113379 2.875952
C  0.328842 -9.193752 -0.31497
C  -2.096285 -9.476886 -0.319797
C  -0.80042 -9.720597 -2.383398
H  -1.205702 -9.481332 2.207746
H  -0.582917 -6.886724 1.954465
H  -0.949167 -7.430361 3.591213
H  1.67892 -6.521477 2.592087
H  1.271806 -7.011881 4.233395
H  3.924612 -8.093807 3.285958
H  3.103974 -8.692758 4.737948
H  3.629093 -9.817237 3.474371
H  0.070915 -8.699376 5.099912
H  -0.635089 -10.282737 4.788889
H  1.030384 -10.152512 5.347154
H  1.513131 -11.169168 1.869188
H  1.842729 -11.521568 3.56428
H  0.215823 -11.738864 2.923585
H  1.211205 -9.150527 -0.946955
H  -2.183512 -10.359256 0.317738
H  -2.249335 -8.576196 0.275664
H  -2.874291 -9.522572 -1.078128
H  -1.438286 -9.012102 -2.917203
H  0.210773 -9.650905 -2.777292
H  -1.17617 -10.731554 -2.563786
O  1.950384 0.236437 5.98209
N  -1.831494 2.108116 5.713935
C  1.191263 -0.828067 8.05986
C  1.062343 0.031538 6.803625
C  -0.268806 0.584589 6.844053
C  -0.873555 0.064621 8.127855
C  -0.14202 0.813497 9.259771
C  1.281797 0.231465 9.185758
C  -0.255808 -1.349836 8.203617
C  2.328833 -1.825615 8.030157
C  -0.54835 -2.097181 9.502431
C  -0.696259 -2.2395 7.041656
C  -0.690586 1.427157 5.863494
C  -2.883834 2.117965 6.702182
C  -2.081833 2.878273 4.520972
H  -1.956388 0.091303 8.199667
H  -0.147702 1.889955 9.086023
H  -0.607504 0.626067 10.226881
H  2.025183 0.990821 8.937431
H  1.586989 -0.233767 10.123023
H  3.261514 -1.305902 7.817658
H  2.42091 -2.340776 8.984075
H  2.165313 -2.556639 7.240677
H  -0.200509 -1.566404 10.381313
H  -1.621038 -2.253959 9.600641
H  -0.065145 -3.071809 9.483936
H  -0.459496 -1.788649 6.08061
H  -0.1983 -3.204941 7.095084
H  -1.769544 -2.407153 7.097067
H  0.023276 1.570805 5.058796
H  -3.500815 1.218127 6.634924
H  -2.460651 2.18474 7.702527
H  -3.518817 2.985934 6.535368
H  -2.275763 3.921765 4.781391
H  -1.220277 2.843637 3.85813
H  -2.952755 2.486882 3.989454
O  10.074851 -2.992658 5.709674
N  8.911765 0.38048 7.965742
C  8.098987 -4.169808 6.581401
C  9.053296 -2.993202 6.391658
C  8.517118 -1.924641 7.200198
C  7.277459 -2.49674 7.846473
C  7.788032 -3.497845 8.90081
C  8.392914 -4.618441 8.034924
C  6.753079 -3.422275 6.725358
C  8.219897 -5.269981 5.548316
C  5.568521 -4.294433 7.129907
C  6.351555 -2.647326 5.470234
C  9.155382 -0.725925 7.254124
C  7.841188 0.482314 8.92693
C  9.619101 1.607013 7.690506
H  6.550849 -1.780041 8.217428
H  8.534749 -3.040113 9.550397
H  6.975545 -3.862345 9.52855
H  9.467276 -4.726953 8.191698
H  7.931628 -5.586019 8.232017
H  9.250246 -5.618669 5.506397
H  7.576389 -6.109722 5.801542
H  7.945156 -4.899585 4.563002
H  5.782774 -4.92711 7.983621
H  4.719369 -3.659667 7.37608
H  5.285355 -4.934945 6.297842
H  7.164331 -2.020059 5.111932
H  6.071994 -3.335127 4.674956
H  5.494817 -2.01233 5.689639
H  10.026493 -0.659522 6.60945
H  6.886781 0.703057 8.440696
H  7.752821 -0.447535 9.483686
H  8.067891 1.286766 9.624832
H  10.056204 2.001587 8.610305
H  10.414965 1.4300 6.971415
H  8.935988 2.356834 7.280915
O  3.86578 5.843357 -1.66209
N  4.742637 6.143631 -5.784648
C  3.522596 8.28017 -1.635821
C  3.815278 6.913747 -2.257709
C  4.067509 7.174579 -3.656023
C  3.925719 8.669832 -3.816524
C  5.1668 9.27316 -3.130773
C  4.912194 8.961417 -1.64542
C  2.794702 8.976607 -2.808303
C  2.85894 8.24053 -0.276265
C  2.51809 10.463478 -2.601849
C  1.47572 8.302509 -3.190307
C  4.386463 6.154779 -4.494934
C  4.891363 7.338055 -6.578381
C  4.847499 4.902319 -6.509552
H  3.744794 9.032083 -4.823901
H  6.082129 8.804553 -3.495076
H  5.242225 10.344026 -3.315633
H  5.659513 8.287176 -1.228761
H  4.896524 9.863397 -1.034609
H  3.38652 7.530613 0.359528
H  2.876465 9.221876 0.193079
H  1.82454 7.916722 -0.369518
H  3.395899 11.013601 -2.282824
H  2.160384 10.900819 -3.532073
H  1.744419 10.593034 -1.848147
H  1.587314 7.223854 -3.273074
H  0.71241 8.511309 -2.444049
H  1.126518 8.68768 -4.146375
H  4.357119 5.172445 -4.033456
H  3.927295 7.691881 -6.954799
H  5.356617 8.122391 -5.986619
H  5.533043 7.114902 -7.429014
H  5.814583 4.843171 -7.013855
H  4.757794 4.062889 -5.824858
H  4.057385 4.829325 -7.262728
totalener: -9171.45419839 hartree
kineticenergy: 9137.89495927 hartree
exchangeener: -756.846846433691 hartree
correlationener: -56.718697356651 hartree
xcener: -813.565543790342 hartree
chargesum: 1.0000000
energy: -9172.544591687341
dipole: 17.48443 -18.95735 -1.47292 -4.45971 8.74545 4.28573 38.87390 -38.34237 0.53153
magnitude: 4.56284 au
magnitude: 11.59782 debye
