program: Orca
programVersion: 5.0.4
elementType: Cu C N N C C C C C C C C C C N H H H H H H H C C C H H C N C H H H C H C H H H C C H C C H C C H H O C C C C C C C C C H C H S O H O Cl H H H H H H H H H H H H O C C C C C C C C C H C H S O H O Cl H H H H H H H H H H H H O C C C C C C C C C H C H S O H O Cl H H H H H H H H H H H H O C C C C C C C C C H C H S O H O Cl H H H H H H H H H H H H O C C C C C C C C C H C H S O H O Cl H H H H H H H H H H H H O C C C C C C C C C H C H S O H O Cl H H H H H H H H H H H H O C C C C C C C C C H C H S O H O Cl H H H H H H H H H H H H O C C C C C C C C C H C H S O H O Cl H H H H H H H H H H H H O C C C C C C C C C H C H S O H O Cl H H H H H H H H H H H H O C C C C C C C C C H C H S O H O Cl H H H H H H H H H H H H
charge: 1
multiplicity: 1
keywords: wB97X-D4 def2-TZVP def2-TZVP/C VeryTightSCF
formula: C124H170Cl10CuN4O30S10
InChI: InChI=1/C15H11N3.10C10H15ClO3S.C8H9.CN.Cu/c1-3-10-16-12(6-1)14-8-5-9-15(18-14)13-7-2-4-11-17-13;10*1-9(2)7-3-4-10(9,8(12)5-7)6-15(11,13)14;1-2-8-6-4-3-5-7-8;1-2;/h1-11H;10*7H,3-6H2,1-2H3;2-7H,1H3;;/q-3;;;;;;;;;;;;;+3/rC16H11CuN4.10C10H15ClO3S.C8H9/c18-12-17-19-10-3-1-6-13(19)15-8-5-9-16(21(15)17)14-7-2-4-11-20(14)17;10*1-9(2)7-3-4-10(9,8(12)5-7)6-15(11,13)14;1-2-8-6-4-3-5-7-8/h1-11H;10*7H,3-6H2,1-2H3;2-7H,1H3
349 atoms
Cu 0.0000 0.0000 0.0000
C  -1.49637 0.01992 -1.23263
N  0.4055 1.98644 0.28558
N  2.01689 -0.0000 0.000001
C  -0.51186 2.95469 0.29398
C  -0.17352 4.29126 0.19642
C  1.16373 4.63301 0.06855
C  2.11831 3.632219 0.04848
C  1.71713 2.30934 0.16318
C  2.63472 1.16661 0.19308
C  3.991329 1.20293 0.48555
C  4.66708 -0.00316 0.608248
C  3.985078 -1.20502 0.501554
C  2.62755 -1.16652 0.207638
N  -2.43984 0.02566 -1.91934
H  -1.5403 2.63743 0.38284
H  -0.94857 5.04262 0.21825
H  1.4603 5.66785 -0.02433
H  3.16401 3.873351 -0.06655
H  4.506821 2.138349 0.639731
H  4.493901 -2.140309 0.676128
H  5.72195 -0.00459 0.841171
C  1.15301 -4.63264 0.19204
C  -0.18759 -4.28545 0.22387
C  -0.52684 -2.94525 0.22873
H  1.45228 -5.67073 0.17697
H  -0.96497 -5.03456 0.23954
C  2.109431 -3.633637 0.165387
N  0.39137 -1.98003 0.22947
C  1.70634 -2.30653 0.186632
H  3.158509 -3.881523 0.120582
H  -1.55783 -2.62424 0.23677
H  -2.15883 0.63658 1.74974
C  -1.75073 -0.13329 2.39835
H  -2.08056 -1.11079 2.05866
C  -0.29507 -0.00688 2.54583
H  -2.20498 0.02488 3.38629
H  0.10912 0.99418 2.51265
H  -0.89255 -2.58481 3.19814
C  0.56769 -0.99239 3.059531
C  0.13767 -2.30671 3.356089
H  2.25692 0.34445 3.06298
C  1.92115 -0.656981 3.292598
C  1.02553 -3.23064 3.853152
H  0.69063 -4.23333 4.07825
C  2.801459 -1.590609 3.789984
C  2.359381 -2.880831 4.065457
H  3.83493 -1.32424 3.959199
H  3.05201 -3.61645 4.450511
O  5.330193 4.580874 2.262654
C  5.522358 5.615388 2.865652
C  6.173974 6.874419 2.367819
C  5.946532 7.837871 3.539344
C  4.5861 7.375964 4.111231
C  3.428055 7.517106 3.121202
C  4.190282 8.057491 5.416558
C  5.06749 5.90273 4.27446
C  6.379625 6.054844 5.081823
C  6.933819 7.419827 4.633734
H  7.946219 7.333184 4.245526
C  4.09469 4.899613 4.820256
H  6.944313 8.134926 5.452546
S  4.755316 3.19338 4.764564
O  6.131729 3.098837 4.406059
H  7.07019 5.244096 4.857925
O  4.25737 2.542998 5.941436
Cl 3.639456 2.379435 3.339182
H  5.709791 7.204212 1.439097
H  7.230593 6.693566 2.170551
H  6.006314 8.888045 3.266239
H  2.487462 7.275341 3.608376
H  3.371637 8.545707 2.773683
H  3.540653 6.862618 2.262357
H  4.14318 9.132014 5.257402
H  3.208185 7.718687 5.733973
H  4.886546 7.857789 6.221276
H  6.160853 6.010325 6.148247
H  3.913683 5.070549 5.878211
H  3.171354 4.868509 4.244278
O  7.266159 -3.655045 6.004741
C  6.986581 -3.020192 6.994103
C  6.731546 -3.546637 8.379271
C  6.484826 -2.260613 9.170431
C  7.446707 -1.258442 8.492749
C  8.9200 -1.669792 8.5680
C  7.325303 0.160423 9.033369
C  6.847731 -1.499817 7.085362
C  5.329989 -1.311971 7.285585
C  5.101078 -1.756042 8.741887
H  4.359752 -2.551274 8.811362
C  7.430681 -0.805228 5.889035
H  4.772605 -0.918348 9.353889
S  6.715824 0.788113 5.445205
O  5.528346 0.630408 4.664277
H  4.764768 -1.91431 6.571254
O  6.784258 1.746385 6.498682
Cl 8.203938 1.283584 4.143485
H  7.592507 -4.114285 8.732441
H  5.875461 -4.223731 8.387522
H  6.602036 -2.371836 10.245824
H  9.552685 -0.864375 8.202111
H  9.189655 -1.867886 9.600843
H  9.136064 -2.552099 7.971877
H  7.585003 0.166091 10.089776
H  8.005116 0.827302 8.507757
H  6.328469 0.567008 8.918417
H  5.068486 -0.265155 7.130449
H  8.499627 -0.635065 5.989811
H  7.234458 -1.396351 4.99517
O  -0.219197 4.222023 8.797395
C  -0.087145 3.043188 8.588739
C  -1.150364 1.983101 8.516292
C  -0.331142 0.707826 8.310322
C  0.812335 1.191166 7.389335
C  0.325465 1.728596 6.039675
C  1.878978 0.138774 7.107417
C  1.244629 2.315137 8.36417
C  1.436207 1.563509 9.701779
C  0.380387 0.442699 9.643279
H  -0.314537 0.49281 10.479332
C  2.349631 3.254757 7.961991
H  0.848226 -0.537858 9.65752
S  3.923117 2.80812 8.707734
O  3.922773 3.13859 10.104706
H  1.305825 2.230699 10.55409
O  4.446595 1.520733 8.383476
Cl 5.159484 4.223384 7.924701
H  -1.826271 2.179777 7.686391
H  -1.756665 1.970791 9.421376
H  -0.906571 -0.131769 7.930262
H  1.166234 1.839675 5.35784
H  -0.370936 1.01626 5.602872
H  -0.165921 2.691289 6.138457
H  1.468342 -0.618003 6.441778
H  2.735861 0.594473 6.614239
H  2.243421 -0.354325 8.00127
H  2.448542 1.167639 9.752991
H  2.520219 3.244298 6.892743
H  2.167721 4.258075 8.345986
O  9.6749 -1.898737 4.25639
C  9.683985 -1.967499 3.05151
C  10.583056 -1.249728 2.086482
C  10.130706 -1.813346 0.735502
C  9.745943 -3.271479 1.074172
C  10.909912 -4.113571 1.598838
C  9.095868 -4.035753 -0.074992
C  8.76727 -2.847943 2.203254
C  7.854244 -1.818031 1.496264
C  8.774441 -1.159529 0.450546
H  8.833189 -0.081757 0.589454
C  8.079752 -3.938713 2.985636
H  8.435609 -1.359398 -0.564551
S  6.304291 -3.701388 3.076256
O  5.983791 -2.488342 3.769579
H  7.458695 -1.092761 2.21056
O  5.561327 -3.903069 1.859186
Cl 5.725366 -5.22071 4.246191
H  11.62889 -1.448961 2.316489
H  10.429757 -0.172021 2.173516
H  10.859518 -1.692886 -0.061745
H  10.586395 -5.139449 1.759177
H  11.712764 -4.122706 0.866559
H  11.29912 -3.73795 2.540538
H  9.832164 -4.204321 -0.857384
H  8.745077 -5.005839 0.272643
H  8.249946 -3.514611 -0.507959
H  7.011211 -2.33064 1.036786
H  8.211279 -4.927747 2.561105
H  8.370397 -3.914329 4.035869
O  4.888282 4.414453 -1.522818
C  5.834691 3.903677 -2.065247
C  6.014324 3.572767 -3.519517
C  7.404867 2.929388 -3.545671
C  8.17384 3.713596 -2.45771
C  8.314524 5.204907 -2.771924
C  9.559023 3.156553 -2.143058
C  7.110251 3.425752 -1.368572
C  6.929582 1.888551 -1.440267
C  7.245684 1.545597 -2.908574
H  6.439023 0.98152 -3.373225
C  7.297341 4.034155 -0.002986
H  8.159796 0.963148 -2.999693
S  7.73661 2.86922 1.300868
O  6.608999 2.149821 1.799326
H  5.910731 1.605415 -1.179958
O  8.909895 2.104004 0.994953
Cl 8.369216 4.202646 2.686606
H  5.946223 4.472526 -4.129125
H  5.221967 2.896232 -3.841989
H  7.869401 2.914323 -4.528158
H  8.932015 5.694653 -2.023118
H  8.800799 5.329363 -3.736082
H  7.355497 5.713132 -2.796775
H  10.161698 3.145675 -3.047978
H  10.059595 3.78321 -1.409093
H  9.52456 2.153945 -1.734501
H  7.604611 1.400411 -0.743186
H  8.095445 4.768424 0.017241
H  6.364186 4.462476 0.364172
O  -0.180325 -2.253257 -2.535016
C  -0.438032 -2.221272 -3.712792
C  -1.526323 -2.962179 -4.444063
C  -1.257996 -2.578783 -5.900892
C  -0.813309 -1.103161 -5.787971
C  -1.877511 -0.172972 -5.205089
C  -0.333032 -0.503856 -7.107273
C  0.317762 -1.433857 -4.774132
C  1.11451 -2.54548 -5.497658
C  0.036492 -3.299122 -6.30289
H  -0.001026 -4.356238 -6.045867
C  1.134804 -0.291975 -4.234285
H  0.214326 -3.227831 -7.373667
S  2.701478 -0.93044 -3.6321
O  2.615066 -1.835142 -2.532238
H  1.627478 -3.181682 -4.774095
O  3.596008 -1.254685 -4.699863
Cl 3.494559 0.781669 -2.842556
H  -2.49751 -2.619214 -4.088284
H  -1.471788 -4.034412 -4.258291
H  -2.093745 -2.76484 -6.57038
H  -1.546639 0.860385 -5.271855
H  -2.799492 -0.266388 -5.773462
H  -2.089505 -0.377712 -4.159646
H  -1.157838 -0.504166 -7.81592
H  -0.020914 0.527601 -6.962296
H  0.493191 -1.048762 -7.54814
H  1.878536 -2.110373 -6.138907
H  1.414204 0.42628 -4.999014
H  0.653061 0.181933 -3.381779
O  2.735301 -6.320166 3.852477
C  3.007085 -7.434751 3.475235
C  2.518876 -8.73844 4.039753
C  3.167517 -9.764653 3.107519
C  3.156814 -9.042992 1.739854
C  1.748404 -8.711612 1.235877
C  3.885848 -9.798541 0.634488
C  3.903237 -7.798002 2.291873
C  5.148153 -8.414281 2.975578
C  4.654637 -9.784499 3.4778
H  4.794541 -9.886614 4.551826
C  4.164594 -6.626494 1.380045
H  5.175868 -10.604925 2.9899
S  5.844381 -6.57766 0.74516
O  6.851971 -6.14955 1.670175
H  5.500502 -7.779073 3.785952
O  6.162285 -7.741076 -0.027606
Cl 5.667912 -5.111739 -0.656169
H  1.430231 -8.77547 4.030208
H  2.850113 -8.83955 5.073107
H  2.693991 -10.742717 3.123071
H  1.79213 -8.355077 0.209206
H  1.135152 -9.60927 1.245791
H  1.264764 -7.950797 1.841592
H  3.342079 -10.71268 0.407041
H  3.939511 -9.196718 -0.269434
H  4.902287 -10.059951 0.900692
H  5.952177 -8.508868 2.24828
H  3.555711 -6.654421 0.481024
H  4.043815 -5.681514 1.906328
O  -0.620162 -5.341282 5.617301
C  -0.480703 -5.094931 6.78985
C  -1.506704 -4.570097 7.748746
C  -0.720025 -4.477861 9.056635
C  0.249228 -5.677763 8.966251
C  -0.463698 -7.030783 8.897203
C  1.265698 -5.734643 10.100362
C  0.815951 -5.233229 7.593101
C  1.217146 -3.758213 7.831678
C  0.207795 -3.268827 8.887495
H  -0.347655 -2.400952 8.539272
C  1.856462 -6.081553 6.914295
H  0.69783 -3.013506 9.824556
S  3.53547 -5.497561 7.186767
O  3.896778 -4.372861 6.382617
H  1.168651 -3.182186 6.90693
O  3.923017 -5.429016 8.566683
Cl 4.538288 -7.114563 6.467158
H  -2.375021 -5.227121 7.796366
H  -1.855973 -3.591938 7.410581
H  -1.338886 -4.442439 9.949164
H  0.258083 -7.842768 8.943535
H  -1.134102 -7.133865 9.746555
H  -1.042276 -7.146754 7.98545
H  0.740567 -5.860597 11.043783
H  1.939373 -6.57723 9.967733
H  1.879377 -4.844454 10.164832
H  2.243488 -3.712953 8.191466
H  1.859691 -7.105298 7.274105
H  1.76035 -6.052564 5.827865
O  -4.56534 -5.175639 6.715799
C  -4.707001 -4.774454 5.587229
C  -5.012329 -5.570281 4.348444
C  -4.939429 -4.506516 3.250101
C  -5.545212 -3.263318 3.940686
C  -6.998987 -3.442264 4.385944
C  -5.465358 -1.981159 3.118178
C  -4.551528 -3.323709 5.127815
C  -3.17631 -3.359246 4.419018
C  -3.45662 -4.133986 3.116391
H  -2.830655 -5.021094 3.039313
C  -4.707474 -2.331786 6.250541
H  -3.284079 -3.526342 2.23103
S  -3.450006 -1.047384 6.230315
O  -2.217047 -1.590355 6.731325
H  -2.419665 -3.853617 5.026517
O  -3.311271 -0.226376 5.063643
Cl -4.05689 0.215614 7.714427
H  -5.997369 -6.028632 4.43213
H  -4.291942 -6.378718 4.222436
H  -5.411955 -4.800596 2.316539
H  -7.402834 -2.488986 4.720417
H  -7.605282 -3.782773 3.549699
H  -7.102167 -4.153313 5.201644
H  -6.190211 -2.028084 2.309097
H  -5.708966 -1.127517 3.745444
H  -4.486186 -1.810249 2.69055
H  -2.851342 -2.338972 4.23693
H  -5.66105 -1.81808 6.217585
H  -4.542632 -2.809629 7.216112
O  -7.499533 4.266929 4.169829
C  -6.326938 4.175748 3.904901
C  -5.552211 4.91143 2.837261
C  -4.105843 4.497488 3.13163
C  -4.097839 4.315923 4.667522
C  -4.395354 5.599181 5.443301
C  -2.808618 3.707473 5.216069
C  -5.298121 3.328893 4.63918
C  -4.858956 2.270958 3.597112
C  -3.946738 3.057563 2.634513
H  -4.259939 2.9525 1.598016
C  -5.782216 2.769492 5.947884
H  -2.911481 2.737548 2.717622
S  -6.752711 1.299436 5.602506
O  -7.676873 1.404132 4.521449
H  -5.73167 1.858398 3.091751
O  -5.934724 0.116649 5.620195
Cl -7.879426 1.146258 7.303508
H  -5.723831 5.984213 2.921218
H  -5.889871 4.612534 1.844724
H  -3.364671 5.191043 2.743438
H  -4.390887 5.402621 6.512881
H  -3.627107 6.340096 5.234834
H  -5.362375 6.023878 5.191203
H  -1.955248 4.244537 4.81051
H  -2.785898 3.815193 6.297935
H  -2.709712 2.655306 4.974773
H  -4.341057 1.447124 4.084584
H  -4.984779 2.419944 6.59678
H  -6.451176 3.455058 6.460345
exchangeener: -1102.060809580661 hartree
correlationener: -69.035495390692 hartree
xcener: -1171.096304971354 hartree
chargesum: 1.0000000
va: 2.8260 3.6000 3.1586 2.9412 4.0710 3.9035 4.0043 4.0012 3.6988 3.7659 3.8166 3.9143 3.9790 3.7930 2.9142 0.9698 0.9706 0.9671 1.0019 0.9432 0.9373 0.9491 3.9260 3.8964 4.0019 0.9728 0.9781 4.0035 3.1966 3.6303 1.0061 0.9644 0.9902 3.9262 1.0024 3.5695 0.9487 0.9500 0.9506 3.4487 3.8035 1.0282 3.8017 3.9473 0.9966 3.9026 3.7542 0.9349 0.9796 2.0345 4.0535 3.9514 3.7394 3.9825 3.9183 3.8976 3.1450 4.0174 4.0200 0.9850 3.8375 0.9695 5.6236 2.0517 0.9886 1.9862 1.2565 0.9803 0.9952 0.9700 0.9759 0.9763 0.9693 0.9753 0.9743 0.9702 0.9797 0.9479 0.9816 2.1000 4.0279 4.0055 3.7958 4.0896 3.9142 3.8840 3.4551 4.0941 4.1214 0.9839 3.6587 0.9722 5.6318 1.9977 0.9780 2.0758 1.1860 0.9815 1.0340 0.9702 0.9779 0.9771 0.9702 0.9734 0.9941 1.0168 0.9782 0.9830 1.0364 2.2177 4.2303 3.9397 3.7598 3.8167 3.9332 3.9024 3.5590 4.0108 4.0815 0.9808 3.8565 0.9776 5.7438 2.1011 0.9834 2.0548 1.2019 0.9971 0.9908 0.9827 0.9925 0.9851 0.9547 0.9688 0.9804 0.9667 0.9937 0.9605 1.0000 2.1766 4.1372 3.9746 3.6973 4.1322 3.9096 3.8670 3.2112 4.0481 4.0723 1.0040 3.7167 0.9671 5.5648 1.9999 0.9746 1.8978 1.2478 0.9761 1.0004 0.9691 0.9774 0.9766 0.9703 0.9783 0.9972 0.9684 0.9773 0.9768 0.9817 2.1584 4.0912 3.9944 3.7085 4.0971 3.9103 3.8925 3.3663 3.9763 4.0865 0.9940 3.7601 0.9686 5.6974 2.0453 1.0254 2.0278 1.2229 0.9787 1.0079 0.9684 0.9792 0.9776 0.9689 0.9720 0.9857 0.9703 1.0230 0.9776 0.9794 2.1534 4.1443 3.9977 3.7454 3.9973 3.8842 3.8842 3.4607 3.9734 4.0224 0.9810 3.7876 0.9706 5.7577 2.0878 0.9907 2.1014 1.1716 0.9802 0.9861 0.9717 0.9813 0.9794 1.0122 0.9780 0.9774 0.9681 0.9732 0.9854 0.9859 2.0798 4.0824 3.9500 3.7250 4.1029 3.9083 3.9018 3.2190 3.9594 4.0546 0.9835 3.7652 0.9712 5.7208 1.9970 1.0027 2.0999 1.2034 0.9808 0.9966 0.9706 0.9722 0.9790 0.9636 0.9681 0.9908 0.9792 1.0058 0.9740 0.9593 2.1151 4.0842 3.9759 3.7082 4.1325 3.9162 3.8963 3.5341 4.0407 4.1379 0.9914 3.7439 0.9622 5.6475 2.0383 0.9828 2.0619 1.2026 0.9736 1.0608 0.9660 0.9760 0.9793 0.9681 0.9701 0.9917 0.9761 1.0044 0.9727 0.9783 2.1761 4.0960 3.9690 3.7641 4.0866 3.9119 3.8963 3.4428 4.0285 4.0802 0.9815 3.7307 0.9765 5.5547 2.0218 0.9925 1.9682 1.1981 0.9733 0.9918 0.9710 0.9838 0.9770 0.9661 0.9776 1.0009 0.9685 1.0044 0.9707 0.9916 2.2429 4.1752 3.9519 3.7212 3.9257 3.9023 3.8624 3.4594 4.0098 4.0652 0.9736 3.8450 0.9676 5.7271 2.1365 0.9845 1.9629 1.1997 0.9795 0.9866 0.9737 0.9751 0.9760 0.9701 0.9780 0.9730 0.9515 0.9831 0.9829 0.9786
energy: -17533.908796610463
dipole: -26.41888 24.88910 -1.52978 -21.38052 21.67456 0.29404 -15.62977 12.25767 -3.37210
magnitude: 3.71453 au
magnitude: 9.44158 debye
