program: Gaussian 09
title: 000006854
version: EM64L-G09RevD.01
frameworkgroup: C1[X(C12H9N)]
method: RPBEPBE
basis: SDD
operation: Freq
keyword: #pfreq=noraman
keyword: PBEPBE/SDD
title: #p freq=noraman PBEPBE/SDD
converged: NO YES NO NO
title: Mulliken charges:
elementType: N C C C C C C C C C C C C H H H H H H H H H
charge: -0.483170 0.184095 0.184096 0.221935 0.221926 -0.394072 -0.394080 -0.363125 -0.363116 -0.254149 -0.254158 -0.214147 -0.214140 0.302132 0.233368 0.233369 0.231812 0.231809 0.222335 0.222337 0.222473 0.222471
chargesum: 0.00000
title: Mulliken charges with hydrogens summed into heavy atoms:
elementType: N C C C C C C C C C C C C
charge: -0.181038 0.184095 0.184096 0.221935 0.221926 -0.160705 -0.160711 -0.131313 -0.131307 -0.031814 -0.031821 0.008326 0.008331
polarizability: 2.23958328e+02 3.49879404e-04 1.37220057e+02 -2.06991848e-03 1.17756251e-03 5.24062151e+01
1716.lowfreq: -0.0006 0.0004 0.0005 10.4157 11.8751 12.8730 112.2824 149.2786 213.3321
frequency: 112.2562 149.2759 213.3321 288.9071 303.5231 422.5794 422.9109 446.6342 494.0170 503.1440 547.2184 565.5289 578.2744 613.6165 650.6385 732.9584 734.5431 747.9093 757.7772 777.8921 838.8860 853.1978 856.7755 865.2552 934.5647 936.4563 972.0721 973.7885 988.6119 1013.5454 1020.1708 1104.7069 1119.9121 1165.0116 1169.9694 1215.6481 1226.6613 1248.5528 1283.7580 1315.6621 1348.2124 1396.7968 1422.4589 1449.8308 1455.5838 1485.3679 1487.0643 1588.7841 1589.0811 1619.5015 1639.6006 3124.4858 3125.0346 3132.8122 3134.1917 3145.9494 3146.8026 3163.0888 3163.9398 3613.5660
redmass: 4.8072 3.6353 4.4777 4.5371 4.5422 6.4381 2.9790 2.8813 1.1454 4.2386 6.8369 3.4765 3.5238 6.9112 6.4864 2.2172 5.4188 1.4825 1.7573 2.5134 4.4575 1.3793 1.6005 5.9590 1.3772 1.4173 1.3133 1.3024 7.0441 2.1586 1.9191 1.8962 1.4770 1.0908 1.0722 2.0660 1.3158 2.5076 2.4412 1.9590 1.8450 3.9170 3.5914 3.5491 2.4373 3.6833 3.3505 6.4261 6.6354 6.6822 7.9076 1.0848 1.0850 1.0890 1.0892 1.0953 1.0954 1.1003 1.1002 1.0801
irintensity: 3.2794 0.0000 0.3635 0.0000 1.8024 1.0993 10.0781 0.0000 95.4117 4.0921 0.0864 12.6895 0.0000 5.7249 1.3673 81.7898 0.0181 0.0000 142.3253 0.0000 1.0159 0.8265 0.0000 0.3836 5.6859 0.0000 0.0000 0.0103 7.9150 0.9448 9.2200 8.5764 5.7832 5.2245 0.2138 5.7126 9.3543 52.2016 2.5377 4.0048 85.6719 0.0025 6.5283 39.7657 24.4291 3.9480 38.5630 2.2346 0.0101 40.8732 3.4331 0.0001 1.4261 6.1879 2.6147 5.9559 58.2441 60.5120 5.2039 47.4241
temp: 298.150 k
press: 1.00000 atm
elementType: 7 6 6 6 6 6 6 6 6 6 6 6 6 1 1 1 1 1 1 1 1 1
symmnumber: 1
zpe: 456963.3 jmol-1
zpe.correction: 0.174048 hartree
zpe.thermalcorrener: 0.182973 hartree
zpe.thermalcorrenthalpy: 0.183917 hartree
zpe.thermalcorrgfe: 0.140129 hartree
zpe.sumelectzpe: -516.581419 hartree
zpe.sumelectthermal: -516.572494 hartree
zpe.sumelectthermalent: -516.571550 hartree
zpe.sumelectthermalfe: -516.615338 hartree
dipole: 0.0001 1.7307 0.0001
dipole: 1.7307
quadrupole: -67.7002 -59.8484 -82.7657
quadrupole: 0.0002 -0.0002 0.0005
quadrupole: 2.4046 10.2564 -12.6610 0.0002 -0.0002 0.0005
hfenergy: -516.7554675 hartree
pointgroup: C01 [X(C12H9N1)]
dipole: -0.0000341 0.6809268 -0.0000342 debye
dipolederiv: -1.0338487 0.000019 0.0000125 0.0000078 -0.4745722 -0.0000075 0.0000021 -0.0000001 -0.323575 0.1550428 0.1654967 -0.0000041 -0.3476221 -0.1479933 0.0000027 0.0000008 0.0000016 -0.0186886 0.1549829 -0.1654993 0.0000012 0.3476258 -0.1479877 -0.0000028 0.0000142 0.000014 -0.0186868 0.4573987 0.3463641 -0.000007 0.7464289 0.2324188 -0.0000091 -0.0000225 -0.0000025 0.0691265 0.4574307 -0.3463966 -0.0000007 -0.7464165 0.2324189 0.0000052 0.0000067 -0.0000151 0.0691274 0.1644365 -0.0664269 0.0000054 0.1002616 0.0961555 -0.0000058 -0.0000006 -0.0000112 -0.1500862 0.1644685 0.0664348 -0.0000176 -0.1002768 0.0961475 -0.0000027 -0.0000162 -0.0000238 -0.1500858 -0.0559634 -0.1902586 0.0000056 -0.0611508 0.0296646 -0.0000025 0.0000021 -0.000003 -0.2101875 -0.0559679 0.1902835 -0.0000135 0.0611453 0.0296679 -0.0000019 -0.0000018 0.0000024 -0.2101904 -0.186009 0.1229839 -0.0000019 0.1760425 -0.0553678 -0.0000037 -0.0000098 -0.0000036 -0.1916303 -0.1860381 -0.1229878 0.0000012 -0.1760541 -0.0553866 0.000006 0.0000032 0.0000027 -0.1916375 -0.0234111 0.0193012 0.0000067 -0.136772 0.1299936 -0.0000051 0.0000145 -0.0000056 -0.1680104 -0.0233975 -0.0193114 -0.0000095 0.1367842 0.1300113 -0.0000087 -0.0000177 -0.0000003 -0.1680063 0.1180934 0.0000026 0.0000009 -0.000002 0.1926752 0.0000058 0.0000014 0.0000085 0.3427475 0.0748625 0.0769799 -0.0000026 0.0246405 -0.085216 0.0000065 -0.0000029 0.0000088 0.1523896 0.0748639 -0.0769777 0.0000059 -0.024642 -0.0852143 0.0000064 0.0000078 0.0000149 0.1523905 0.062883 0.0232871 -0.0000011 0.0763594 -0.1094555 0.0000047 -0.0000018 0.0000045 0.178364 0.062878 -0.0232922 0.0000047 -0.0763634 -0.1094603 0.0000052 0.000005 0.000001 0.1783633 -0.0497103 -0.106974 0.0000024 -0.1245814 -0.0273936 0.0000041 0.0000043 0.0000048 0.1676687 -0.0497086 0.1069718 0.0000045 0.1245792 -0.0273926 -0.0000026 0.0000019 -0.0000005 0.1676709 -0.1416395 0.0522593 -0.0000042 0.0519378 0.0781424 0.0000025 -0.0000086 0.0000019 0.1614694 -0.1416468 -0.0522593 0.000011 -0.0519321 0.0781444 0.0000035 0.0000179 0.0000005 0.1614672 unknown
polarizability: 223.9583282|-0.0002794|137.2200574|-0.0020699|-0.0011776|52.4062151 unknown
InChI: InChI=1S/C12H9N/c1-3-7-11-9(5-1)10-6-2-4-8-12(10)13-11/h1-8,13H
charge 0 multiplicity 1
22 atoms
N  -0.00001 1.687621 -0.000105
C  -0.7299 -0.499406 -0.00006
C  0.729895 -0.499395 -0.000057
C  -1.148644 0.877449 -0.000084
C  1.148619 0.877475 -0.000086
C  -1.711079 -1.519267 -0.000052
C  1.711057 -1.519261 -0.000107
C  -2.510996 1.246537 -0.000107
C  2.51098 1.246542 -0.000162
C  -3.075732 -1.158894 -0.000067
C  3.075719 -1.158893 -0.000152
C  -3.46897 0.2093 -0.000094
C  3.468946 0.209304 -0.000168
H  -0.000031 2.704639 -0.000141
H  -1.418156 -2.57503 -0.000021
H  1.418143 -2.575026 -0.000071
H  -2.821249 2.297298 -0.000128
H  2.821245 2.297301 -0.00019
H  -3.844145 -1.939606 -0.000051
H  3.844128 -1.939606 -0.00017
H  -4.535004 0.463667 -0.000115
H  4.534986 0.46365 -0.000212
