program: Orca
programVersion: 5.0.4
elementType: Cu C N N C C C C C C C C C C N H H H H H H H C C C H H C N C H H H C H C H H H C C H C C H C C H H Br Br O C C C C C C C C C C H H H H H H H H H H H H H H Br Br O C C C C C C C C C C H H H H H H H H H H H H H H Br Br O C C C C C C C C C C H H H H H H H H H H H H H H Br Br O C C C C C C C C C C H H H H H H H H H H H H H H Br Br O C C C C C C C C C C H H H H H H H H H H H H H H Br Br O C C C C C C C C C C H H H H H H H H H H H H H H Br Br O C C C C C C C C C C H H H H H H H H H H H H H H Br Br O C C C C C C C C C C H H H H H H H H H H H H H H Br Br O C C C C C C C C C C H H H H H H H H H H H H H H Br Br O C C C C C C C C C C H H H H H H H H H H H H H H
charge: 1
multiplicity: 1
keywords: wB97X-D4 def2-TZVP def2-TZVP/C VeryTightSCF
formula: C124H160Br20CuN4O10
InChI: InChI=1/C15H11N3.10C10H14Br2O.C8H9.CN.Cu/c1-3-10-16-12(6-1)14-8-5-9-15(18-14)13-7-2-4-11-17-13;10*1-9(5-11)7-2-3-10(9,6-12)8(13)4-7;1-2-8-6-4-3-5-7-8;1-2;/h1-11H;10*7H,2-6H2,1H3;2-7H,1H3;;/q-3;;;;;;;;;;;;;+3/rC16H11CuN4.10C10H14Br2O.C8H9/c18-12-17-19-10-3-1-6-13(19)15-8-5-9-16(21(15)17)14-7-2-4-11-20(14)17;10*1-9(5-11)7-2-3-10(9,6-12)8(13)4-7;1-2-8-6-4-3-5-7-8/h1-11H;10*7H,2-6H2,1H3;2-7H,1H3
319 atoms
Cu 0.0000 0.0000 0.0000
C  1.49637 0.01992 -1.232631
N  -0.4055 1.98644 0.285581
N  -2.01689 -0.0000 0.000001
C  0.51186 2.95469 0.293979
C  0.17352 4.291261 0.19642
C  -1.16373 4.633009 0.06855
C  -2.11831 3.632222 0.04848
C  -1.71713 2.30934 0.163179
C  -2.63472 1.166611 0.193077
C  -3.991335 1.202926 0.485557
C  -4.66708 -0.00316 0.608249
C  -3.985081 -1.20502 0.501551
C  -2.62755 -1.16652 0.207639
N  2.43984 0.02566 -1.91934
H  1.5403 2.63743 0.38284
H  0.94857 5.04262 0.21825
H  -1.4603 5.66785 -0.02433
H  -3.164012 3.873348 -0.066549
H  -4.506814 2.138354 0.639725
H  -4.493899 -2.14031 0.67613
H  -5.72195 -0.00459 0.84117
C  -1.15301 -4.63264 0.19204
C  0.18759 -4.28545 0.22387
C  0.52684 -2.94525 0.22873
H  -1.45228 -5.67073 0.17697
H  0.96497 -5.034561 0.23954
C  -2.10943 -3.63364 0.16539
N  -0.39137 -1.98003 0.22947
C  -1.70634 -2.30653 0.18663
H  -3.15851 -3.88152 0.12058
H  1.55783 -2.62424 0.23677
H  2.15883 0.63658 1.74974
C  1.75073 -0.13329 2.39835
H  2.08056 -1.11079 2.05866
C  0.29507 -0.00688 2.54583
H  2.20498 0.02488 3.38629
H  -0.10912 0.99418 2.51265
H  0.89255 -2.58481 3.198139
C  -0.56769 -0.99239 3.059529
C  -0.137669 -2.306711 3.356092
H  -2.25692 0.34445 3.06298
C  -1.921149 -0.65698 3.292601
C  -1.025531 -3.230639 3.853147
H  -0.69063 -4.23333 4.078251
C  -2.801461 -1.590609 3.789979
C  -2.359378 -2.880831 4.065463
H  -3.83493 -1.32424 3.9592
H  -3.05201 -3.616449 4.45051
Br 0.34349 4.155889 -3.771608
Br -2.642839 -1.980035 -3.19542
O  -3.58247 0.913412 -2.553027
C  -1.883984 0.552141 -4.25905
C  -2.952399 1.319108 -3.498531
C  -3.071238 2.657466 -4.181486
C  -2.03799 2.542561 -5.304911
C  -2.625169 1.574171 -6.33913
C  -2.584873 0.224168 -5.601675
C  -0.916917 1.703441 -4.647055
C  -0.30476 2.349565 -3.404782
C  0.210465 1.305915 -5.592911
C  -1.299041 -0.633846 -3.537381
H  -2.857798 3.465461 -3.48023
H  -4.085597 2.823123 -4.545619
H  -1.724322 3.496686 -5.721825
H  -2.029417 1.557819 -7.24962
H  -3.637382 1.862026 -6.61857
H  -2.017272 -0.529134 -6.148671
H  -3.583571 -0.180137 -5.428687
H  -1.012285 2.453997 -2.583607
H  0.563078 1.797046 -3.04302
H  0.717291 2.201429 -5.947748
H  -0.143522 0.759523 -6.459265
H  0.936844 0.685033 -5.071234
H  -0.53223 -1.126924 -4.133701
H  -0.89386 -0.357326 -2.561229
Br 3.017279 7.158575 7.006087
Br -1.706918 3.17034 3.946574
O  0.047057 5.846818 2.911266
C  0.783263 4.341886 4.679417
C  0.937301 5.381474 3.585575
C  2.410406 5.696758 3.526362
C  2.980702 4.835259 4.658107
C  2.959872 3.391195 4.148678
C  1.455844 3.091449 4.063029
C  1.841344 4.834142 5.703376
C  1.470552 6.216909 6.234587
C  2.070551 3.904767 6.889431
C  -0.617363 4.144388 5.198227
H  2.580771 6.765499 3.662482
H  2.819873 5.425872 2.552344
H  3.947299 5.171484 5.024329
H  3.460108 2.722672 4.843754
H  3.445092 3.311322 3.177449
H  1.181939 2.205224 4.630388
H  1.136981 2.96317 3.028692
H  1.080109 6.884182 5.467313
H  0.744585 6.142676 7.044218
H  2.949758 4.233477 7.439665
H  2.217991 2.874905 6.58822
H  1.218051 3.932131 7.565727
H  -0.631603 3.559589 6.116241
H  -1.124428 5.096848 5.358156
Br -6.091675 0.440713 7.486288
Br 0.690923 0.124171 6.427327
O  -1.120895 2.347245 7.835672
C  -1.846319 0.021337 7.778525
C  -1.858318 1.474149 8.226364
C  -2.930767 1.575524 9.277502
C  -3.426814 0.130203 9.379002
C  -2.307162 -0.665509 10.063635
C  -1.201981 -0.693018 8.992457
C  -3.346314 -0.361689 7.915402
C  -4.209372 0.427801 6.934659
C  -3.653163 -1.844112 7.727289
C  -1.211106 -0.257613 6.443981
H  -3.700561 2.277804 8.952447
H  -2.526756 1.964576 10.212543
H  -4.397522 0.027807 9.858172
H  -2.638484 -1.667266 10.330114
H  -1.978513 -0.176765 10.979832
H  -0.914877 -1.708936 8.720052
H  -0.30003 -0.172467 9.320437
H  -3.920801 1.472028 6.85195
H  -4.214122 -0.027283 5.94587
H  -4.685487 -2.030058 8.014743
H  -3.018017 -2.486121 8.325827
H  -3.533364 -2.119639 6.682434
H  -1.29329 -1.310405 6.181774
H  -1.646291 0.363717 5.662482
Br 5.571671 4.655735 -6.067698
Br 4.361723 3.354152 0.505856
O  2.628737 3.157052 -1.97978
C  5.039326 2.88885 -2.206204
C  3.582463 2.80951 -2.631192
C  3.590824 2.177779 -3.998772
C  5.082742 1.960345 -4.25681
C  5.509177 0.797577 -3.354606
C  5.382013 1.401708 -1.946877
C  5.729354 3.181605 -3.56434
C  5.275571 4.527451 -4.128321
C  7.253998 3.153432 -3.533275
C  5.346931 3.822015 -1.066529
H  3.110124 2.82969 -4.728824
H  3.029844 1.24309 -3.9663
H  5.339979 1.830724 -5.305689
H  6.525988 0.476117 -3.573237
H  4.851294 -0.060374 -3.481351
H  6.297345 1.314976 -1.361341
H  4.576029 0.923887 -1.38514
H  4.213289 4.719617 -3.983032
H  5.847983 5.349545 -3.698174
H  7.636414 3.119884 -4.551715
H  7.640556 2.294262 -2.996613
H  7.645723 4.051205 -3.055833
H  6.397402 3.769561 -0.780005
H  5.068467 4.851242 -1.299079
Br -4.374745 4.258057 6.419924
Br -7.549515 6.271541 0.701789
O  -5.377029 4.092933 1.290305
C  -6.93347 4.722329 3.058601
C  -5.89606 3.856023 2.35455
C  -5.676089 2.666473 3.246156
C  -6.617874 2.953111 4.41585
C  -8.037525 2.722229 3.8868
C  -8.229995 3.891045 2.905251
C  -6.550678 4.491184 4.546259
C  -5.15479 5.039652 4.82613
C  -7.516588 5.075602 5.571768
C  -7.025247 6.152787 2.588597
H  -4.625931 2.589829 3.531789
H  -5.926645 1.731896 2.747387
H  -6.394967 2.390259 5.31593
H  -8.76831 2.744138 4.691179
H  -8.114901 1.756654 3.39289
H  -9.099217 4.503458 3.145004
H  -8.342004 3.551244 1.876431
H  -4.449037 4.834313 4.022984
H  -5.183656 6.113983 5.014576
H  -7.296654 4.663132 6.555444
H  -8.550037 4.846733 5.341136
H  -7.416438 6.159939 5.627233
H  -7.7852 6.70889 3.136662
H  -6.064883 6.664588 2.653212
Br -4.559641 -8.88777 -1.346528
Br -8.563635 -3.529146 -0.711152
O  -5.637706 -4.010807 -0.215888
C  -6.739804 -5.315604 -1.964504
C  -5.57271 -4.7746 -1.145462
C  -4.328573 -5.33597 -1.782658
C  -4.890791 -6.124118 -2.963575
C  -5.393246 -5.083067 -3.971538
C  -6.627593 -4.491015 -3.268666
C  -6.194837 -6.708692 -2.378238
C  -6.006466 -7.589974 -1.142243
C  -7.0391 -7.47196 -3.39203
C  -8.088802 -5.298623 -1.296323
H  -3.790556 -5.969037 -1.077766
H  -3.661124 -4.53107 -2.092776
H  -4.202594 -6.851133 -3.387011
H  -5.650947 -5.538338 -4.925676
H  -4.632611 -4.325416 -4.153361
H  -7.535252 -4.598857 -3.864831
H  -6.494337 -3.43152 -3.043467
H  -5.768474 -7.021963 -0.245112
H  -6.899671 -8.182943 -0.945933
H  -6.500372 -8.364082 -3.707284
H  -7.257967 -6.884378 -4.27651
H  -7.9831 -7.785185 -2.947314
H  -8.883853 -5.608429 -1.975414
H  -8.096672 -5.919744 -0.401497
Br -6.633369 -1.055461 3.56103
Br -9.564802 -7.012219 2.116862
O  -6.781969 -5.929312 1.501674
C  -7.886454 -5.085115 3.504257
C  -6.739842 -5.283067 2.522099
C  -5.549943 -4.586943 3.118436
C  -6.097966 -4.108635 4.463309
C  -6.293566 -5.367758 5.316764
C  -7.486518 -6.06416 4.636221
C  -7.545733 -3.698733 4.114058
C  -7.654264 -2.599095 3.061877
C  -8.383665 -3.288383 5.321257
C  -9.281437 -5.251515 2.960033
H  -5.230612 -3.773046 2.46752
H  -4.704049 -5.270484 3.209752
H  -5.505848 -3.335741 4.943997
H  -6.513829 -5.119421 6.352504
H  -5.398384 -5.987069 5.302373
H  -8.326841 -6.212002 5.315097
H  -7.222061 -7.040714 4.227219
H  -7.291543 -2.891122 2.079285
H  -8.676686 -2.240238 2.959335
H  -7.954947 -2.394286 5.771191
H  -8.425712 -4.058178 6.082685
H  -9.404097 -3.057993 5.018363
H  -10.028003 -5.190823 3.750868
H  -9.498849 -4.515448 2.185817
Br 3.445886 -10.186761 5.294045
Br -2.447592 -6.945118 3.851221
O  0.020263 -6.26584 5.684625
C  0.284689 -7.733383 3.756353
C  0.733237 -6.785687 4.862856
C  2.224561 -6.644325 4.704011
C  2.519045 -7.571871 3.522609
C  1.999347 -6.8503 2.274017
C  0.473342 -6.905382 2.463018
C  1.490099 -8.712194 3.711366
C  1.627146 -9.470045 5.03075
C  1.465987 -9.728653 2.573889
C  -1.092933 -8.320026 3.939345
H  2.736769 -6.933394 5.622087
H  2.491367 -5.606482 4.501464
H  3.554838 -7.894117 3.456319
H  2.316166 -7.359705 1.366456
H  2.37253 -5.827712 2.235884
H  -0.028648 -7.403182 1.633667
H  0.037122 -5.913027 2.572833
H  1.430109 -8.852084 5.904962
H  0.971037 -10.339983 5.054648
H  2.432314 -10.226305 2.517757
H  1.265711 -9.274284 1.611049
H  0.707809 -10.489807 2.75375
H  -1.339968 -9.029729 3.150192
H  -1.208603 -8.789566 4.916829
Br -8.82656 -0.109801 0.783185
Br -8.885799 1.74991 -5.875466
O  -10.191487 3.109468 -3.028918
C  -8.286251 1.588664 -3.040816
C  -9.200893 2.673795 -2.493371
C  -8.631915 3.051238 -1.149236
C  -7.421666 2.120576 -1.029373
C  -6.367242 2.661101 -1.997235
C  -6.970719 2.331803 -3.372405
C  -7.910876 0.833117 -1.734088
C  -9.139827 0.20283 -1.082235
C  -6.861221 -0.258937 -1.915162
C  -8.875327 0.773335 -4.166803
H  -9.380173 2.90783 -0.367844
H  -8.364924 4.108565 -1.129205
H  -7.060199 1.994633 -0.012623
H  -5.407568 2.170851 -1.8536
H  -6.223737 3.730421 -1.85296
H  -6.327385 1.672642 -3.955175
H  -7.171234 3.222941 -3.967967
H  -10.032596 0.82367 -1.140646
H  -9.353385 -0.778504 -1.504353
H  -6.773769 -0.847429 -1.005794
H  -5.87986 0.131313 -2.154931
H  -7.16554 -0.940705 -2.70696
H  -8.294187 -0.126557 -4.360545
H  -9.915807 0.514865 -3.969447
Br 4.126776 -3.279123 2.220802
Br 9.98949 0.232189 1.631723
O  7.021696 0.822574 0.787832
C  7.441395 -0.675535 2.667162
C  6.627351 0.252569 1.775703
C  5.250828 0.304922 2.383022
C  5.386933 -0.618184 3.595663
C  6.238994 0.140912 4.61874
C  7.626432 0.168309 3.952833
C  6.359023 -1.708398 3.088622
C  5.847748 -2.485262 1.878586
C  6.793022 -2.707365 4.15705
C  8.713955 -1.213696 2.062459
H  4.507565 -0.021657 1.656675
H  4.987483 1.329126 2.644403
H  4.443174 -0.981185 3.994604
H  6.261315 -0.370989 5.578215
H  5.8491 1.142185 4.786238
H  8.402715 -0.270929 4.578899
H  7.947123 1.179871 3.701612
H  5.7185 -1.865666 0.99316
H  6.509646 -3.316696 1.635184
H  5.918557 -3.217279 4.558492
H  7.308099 -2.230749 4.982503
H  7.461691 -3.457298 3.735184
H  9.241107 -1.870282 2.753029
H  8.529927 -1.726812 1.118619
exchangeener: -1977.513340173242 hartree
correlationener: -89.308149053065 hartree
xcener: -2066.821489226307 hartree
chargesum: 1.0000000
qa: -0.1546 -0.4229 -0.0686 0.1099 -0.1257 -0.0564 -0.0547 -0.2086 0.1422 0.1173 -0.2461 -0.0494 -0.2360 0.1703 -0.0757 0.1909 0.1371 0.1456 0.1754 0.1687 0.1420 0.1508 -0.1026 -0.1086 -0.1365 0.1547 0.1659 -0.2434 0.0198 0.2362 0.1792 0.1803 0.1538 -0.3835 0.1098 0.0998 0.1770 0.1690 0.1190 0.2634 -0.1733 0.1328 -0.2140 -0.0091 0.1182 -0.0976 -0.1869 0.1195 0.1590 -0.1297 -0.1499 -0.3514 0.3021 -0.0996 -0.2363 0.0301 -0.2635 -0.2923 0.1011 -0.2724 -0.4037 -0.0616 0.1499 0.1490 0.1472 0.1318 0.1179 0.1329 0.1291 0.0820 0.1680 0.1487 0.1349 0.1408 0.1615 0.0427 -0.1085 -0.1524 -0.2775 0.3858 -0.0779 -0.2310 0.0822 -0.3343 -0.3043 -0.0247 -0.2294 -0.3854 -0.1788 0.1541 0.1389 0.1504 0.1191 0.0901 0.0780 0.0561 0.1635 0.1577 0.1488 0.1058 0.1416 0.1592 0.1529 -0.1102 -0.1077 -0.3149 0.3299 -0.0204 -0.2134 -0.0027 -0.2618 -0.2856 0.0825 -0.2365 -0.3870 -0.2924 0.1558 0.1428 0.1506 0.1324 0.1202 0.1387 0.1412 0.1211 0.0950 0.1500 0.1418 0.0843 0.1501 0.1351 -0.1195 -0.1338 -0.3299 0.3823 -0.1000 -0.2694 0.0853 -0.2203 -0.3675 -0.0678 -0.2324 -0.3953 -0.1707 0.1502 0.1283 0.1400 0.1207 0.1081 0.1591 0.1306 0.1610 0.1479 0.1464 0.1377 0.1183 0.1622 0.1421 -0.1127 -0.0988 -0.3189 0.2940 -0.0825 -0.2621 0.0609 -0.2583 -0.2856 0.0095 -0.2648 -0.3938 -0.1795 0.1254 0.0994 0.1450 0.1316 0.1114 0.1401 0.1170 0.1778 0.1634 0.1506 0.1357 0.1285 0.1594 0.1459 -0.1354 -0.1388 -0.3593 0.2931 -0.0097 -0.3771 0.0927 -0.2958 -0.2911 -0.0061 -0.2304 -0.3942 -0.1415 0.1389 0.1613 0.1454 0.1348 0.1177 0.1369 0.1208 0.1685 0.1569 0.1483 0.1288 0.1311 0.1554 0.1671 -0.1522 -0.1096 -0.3387 0.2445 0.0145 -0.2429 -0.0152 -0.2555 -0.2952 0.1089 -0.3244 -0.3892 -0.2002 0.1324 0.0962 0.1371 0.1319 0.1173 0.1391 0.1427 0.1806 0.1757 0.1509 0.1317 0.1322 0.1568 0.1602 -0.1014 -0.1176 -0.2539 0.2796 -0.0932 -0.2149 0.0511 -0.2952 -0.3901 -0.0248 -0.2358 -0.3939 -0.1721 0.1567 0.1241 0.1532 0.1391 0.0894 0.1366 0.1125 0.1669 0.1571 0.1551 0.1275 0.1298 0.1631 0.1545 -0.1344 -0.1059 -0.2423 0.1993 -0.0611 -0.2345 0.0521 -0.3053 -0.3118 0.1094 -0.2237 -0.5148 -0.1819 0.1451 0.1307 0.1019 0.1049 0.1162 0.1247 0.1477 0.1784 0.1696 0.1275 0.1719 0.1252 0.1317 0.1486 -0.1452 -0.0935 -0.2847 0.2403 -0.0602 -0.3114 0.0746 -0.2814 -0.3016 0.0018 -0.2238 -0.3927 -0.1898 0.1648 0.1255 0.1345 0.1340 0.1168 0.1411 0.1479 0.1810 0.1631 0.1399 0.1373 0.1307 0.1539 0.1421
va: 3.0090 3.5251 3.0882 2.9212 4.0532 3.9466 4.0025 3.9136 3.5675 3.9635 3.8447 3.9773 3.9260 3.6679 2.8127 0.9831 0.9869 0.9715 0.9725 0.9788 0.9844 0.9876 3.9751 3.8491 4.0834 0.9750 0.9558 3.9844 3.1705 3.6776 0.9652 0.9729 1.0072 3.9224 1.0249 3.5244 0.9658 0.9975 0.9825 3.5321 3.8805 0.9796 3.8673 3.8660 0.9837 3.8178 3.9063 1.0123 0.9676 1.1289 1.1270 2.0653 3.5904 4.0271 3.9955 3.7639 4.0439 3.9765 3.9692 4.0835 3.8812 3.9032 0.9855 0.9824 0.9815 0.9700 0.9812 0.9713 0.9828 1.0019 0.9645 0.9803 0.9640 0.9716 0.9637 1.0698 1.1375 1.1348 2.1963 3.4742 4.1592 3.9288 3.7334 4.1381 3.9343 4.0830 4.0001 3.8843 3.8480 0.9858 1.0061 0.9763 0.9685 0.9941 1.0528 1.0218 0.9546 0.9605 0.9813 0.9777 0.9838 1.0076 0.9722 1.1497 1.1485 2.1294 3.4328 4.0764 3.9411 3.7662 4.0420 3.9691 3.9681 4.0059 3.8974 3.9233 0.9814 0.9896 0.9754 0.9715 0.9804 0.9692 0.9818 1.0169 0.9854 0.9824 0.9695 0.9872 0.9567 0.9786 1.1277 1.1452 2.1023 3.4954 4.0659 3.9685 3.8273 4.0496 4.0088 4.1040 4.0007 3.8925 3.8723 0.9767 0.9992 0.9745 0.9639 0.9985 0.9780 0.9948 0.9567 0.9597 0.9802 0.9664 0.9738 0.9657 0.9649 1.1535 1.1302 2.1182 3.5431 4.0810 3.9877 3.7380 4.0695 4.0213 4.0537 3.9795 3.8990 3.9365 0.9971 1.0206 0.9819 0.9708 1.0008 0.9743 1.0021 0.9468 0.9591 0.9765 0.9663 0.9727 0.9576 0.9650 1.1189 1.1123 2.0671 3.6565 3.9621 4.0288 3.6906 4.0686 4.0055 4.0291 3.9573 3.8983 3.8329 0.9926 0.9761 0.9768 0.9695 0.9938 0.9704 0.9909 0.9897 0.9655 0.9763 0.9683 0.9724 0.9613 0.9843 1.1236 1.1120 2.1104 3.5659 4.1125 3.9582 3.7601 4.0260 3.9821 3.9931 3.9541 3.8966 3.9206 0.9868 1.0292 0.9434 0.9696 0.9960 0.9706 0.9887 0.9635 0.9570 0.9772 0.9687 0.9735 0.9595 0.9688 1.1435 1.1534 2.2155 3.4581 4.1960 3.9125 3.7398 4.0578 3.9699 4.0353 4.0105 3.8827 3.9164 0.9873 0.9976 0.9788 0.9698 1.0062 0.9696 0.9995 0.9527 0.9598 0.9819 0.9662 0.9735 0.9600 0.9672 1.1464 1.1230 2.2512 3.5220 4.2432 3.8489 3.7378 4.0240 3.9705 3.9339 3.9069 3.9579 3.9840 0.9893 1.0136 0.9671 1.0460 0.9868 0.9752 0.9821 0.9586 0.9611 0.9801 0.9633 0.9668 0.9670 0.9655 1.1407 1.1291 2.1605 3.5742 4.1408 3.8880 3.6642 4.0552 3.9572 4.0391 3.9370 3.9033 3.9760 0.9768 1.0172 0.9699 0.9683 0.9877 0.9740 0.9886 0.9541 0.9613 0.9755 0.9683 0.9729 0.9561 0.9652
energy: -58919.796370085707
dipole: 53.16307 -52.08179 1.08128 -37.85195 33.61640 -4.23555 6.45969 -1.71602 4.74367
magnitude: 6.45069 au
magnitude: 16.39636 debye
